BDBM50163559 CHEMBL3794168
SMILES: [H][C@@]12C[C@@]([H])(C1(C)C)[C@]1(C)OB(OC1C2)[C@H](CC(C)C)NC(=O)[C@H](Cc1ccccc1)NC(=O)[C@H]1CCCc2ccccc12
InChI Key: InChIKey=VOTDVUBZDFZSLV-XWRXRWDISA-N
Data: 2 IC50
Activity Spreadsheet -- Enzyme Inhibition Constant Data from BindingDB
Found 2 hits for monomerid = 50163559
Trg + Lig
Ki
nM
ΔG°
kcal/mole
IC50
nM
Kd
nM
EC50/IC50
nM
koff
s-1
kon
M-1s-1
pHTemp
°C
20S proteasome chymotrypsin-like
(Homo sapiens (Human))
BDBM50163559
(CHEMBL3794168)
Show SMILES [H][C@@]12C[C@@]([H])(C1(C)C)[C@]1(C)OB(OC1C2)[C@H](CC(C)C)NC(=O)[C@H](Cc1ccccc1)NC(=O)[C@H]1CCCc2ccccc12 |r|
Show InChI InChI=1S/C35H47BN2O4/c1-22(2)18-31(36-41-30-21-25-20-29(34(25,3)4)35(30,5)42-36)38-33(40)28(19-23-12-7-6-8-13-23)37-32(39)27-17-11-15-24-14-9-10-16-26(24)27/h6-10,12-14,16,22,25,27-31H,11,15,17-21H2,1-5H3,(H,37,39)(H,38,40)/t25-,27-,28-,29-,30?,31-,35-/m0/s1
Reactome pathway
n/an/a 8.93E+8n/an/an/an/an/an/a
Nanjing Forestry University
Curated by ChEMBL
Assay Description
Inhibition of chymotrypsin like activity of human 20S proteasome using Suc-Leu-Leu-Val-Tyr-AMC as substrate preincubated for 10 mins followed by subs...
Bioorg Med Chem 24: 2576-88 (2016)
BindingDB Entry DOI: 10.7270/Q2P84DSC
20S proteasome chymotrypsin-like
(Homo sapiens (Human))
BDBM50163559
(CHEMBL3794168)
Show SMILES [H][C@@]12C[C@@]([H])(C1(C)C)[C@]1(C)OB(OC1C2)[C@H](CC(C)C)NC(=O)[C@H](Cc1ccccc1)NC(=O)[C@H]1CCCc2ccccc12 |r|
Show InChI InChI=1S/C35H47BN2O4/c1-22(2)18-31(36-41-30-21-25-20-29(34(25,3)4)35(30,5)42-36)38-33(40)28(19-23-12-7-6-8-13-23)37-32(39)27-17-11-15-24-14-9-10-16-26(24)27/h6-10,12-14,16,22,25,27-31H,11,15,17-21H2,1-5H3,(H,37,39)(H,38,40)/t25-,27-,28-,29-,30?,31-,35-/m0/s1
Reactome pathway
n/an/a 1.10n/an/an/an/an/an/a
Nanjing Forestry University
Curated by ChEMBL
Assay Description
Inhibition of chymotrypsin like activity of human 20S proteasome using Suc-Leu-Leu-Val-Tyr-AMC as substrate preincubated for 10 mins followed by subs...
Bioorg Med Chem 24: 2576-88 (2016)
BindingDB Entry DOI: 10.7270/Q2P84DSC