BDBM50163637 1-{(1R,2S)-2-[(S)-3-(4-Fluoro-benzyl)-piperidin-1-ylmethyl]-cyclohexyl}-3-(1-methyl-1H-pyrazol-3-yl)-urea::CHEMBL365732
SMILES: Cn1ccc(NC(=O)N[C@@H]2CCCC[C@H]2CN2CCC[C@@H](Cc3ccc(F)cc3)C2)n1
InChI Key: InChIKey=GGWUCCLVCATVGO-JAXLGGSGSA-N
Data: 1 IC50
Activity Spreadsheet -- Enzyme Inhibition Constant Data from BindingDB
Found 1 hit for monomerid = 50163637
Trg + Lig
Ki
nM
ΔG°
kcal/mole
IC50
nM
Kd
nM
EC50/IC50
nM
koff
s-1
kon
M-1s-1
pHTemp
°C
C-C chemokine receptor type 3
(Homo sapiens (Human))
BDBM50163637
(1-{(1R,2S)-2-[(S)-3-(4-Fluoro-benzyl)-piperidin-1-...)
Show SMILES Cn1ccc(NC(=O)N[C@@H]2CCCC[C@H]2CN2CCC[C@@H](Cc3ccc(F)cc3)C2)n1
Show InChI InChI=1S/C24H34FN5O/c1-29-14-12-23(28-29)27-24(31)26-22-7-3-2-6-20(22)17-30-13-4-5-19(16-30)15-18-8-10-21(25)11-9-18/h8-12,14,19-20,22H,2-7,13,15-17H2,1H3,(H2,26,27,28,31)/t19-,20-,22+/m0/s1
Reactome pathway
n/an/a 1.90n/an/an/an/an/an/a
Pharmaceutical Research Institute
Curated by ChEMBL
Assay Description
Inhibition of eotaxin-induced chemotaxis of human eosinophils
J Med Chem 48: 2194-211 (2005)
Article DOI: 10.1021/jm049530m
BindingDB Entry DOI: 10.7270/Q2XP74F1