BDBM50163680 1-{(1R,2S)-2-[(S)-3-(4-Fluoro-benzyl)-piperidin-1-ylmethyl]-cyclohexyl}-3-(5-fluoro-2-methyl-phenyl)-urea::CHEMBL364673
SMILES: Cc1ccc(F)cc1NC(=O)N[C@@H]1CCCC[C@H]1CN1CCC[C@@H](Cc2ccc(F)cc2)C1
InChI Key: InChIKey=LRWILVHFHINPBK-WRALFONMSA-N
Data: 1 IC50
Activity Spreadsheet -- Enzyme Inhibition Constant Data from BindingDB
Found 1 hit for monomerid = 50163680
Trg + Lig
Ki
nM
ΔG°
kcal/mole
IC50
nM
Kd
nM
EC50/IC50
nM
koff
s-1
kon
M-1s-1
pHTemp
°C
C-C chemokine receptor type 3
(Homo sapiens (Human))
BDBM50163680
(1-{(1R,2S)-2-[(S)-3-(4-Fluoro-benzyl)-piperidin-1-...)
Show SMILES Cc1ccc(F)cc1NC(=O)N[C@@H]1CCCC[C@H]1CN1CCC[C@@H](Cc2ccc(F)cc2)C1
Show InChI InChI=1S/C27H35F2N3O/c1-19-8-11-24(29)16-26(19)31-27(33)30-25-7-3-2-6-22(25)18-32-14-4-5-21(17-32)15-20-9-12-23(28)13-10-20/h8-13,16,21-22,25H,2-7,14-15,17-18H2,1H3,(H2,30,31,33)/t21-,22-,25+/m0/s1
Reactome pathway
n/an/a 4.60n/an/an/an/an/an/a
Pharmaceutical Research Institute
Curated by ChEMBL
Assay Description
Inhibition of eotaxin-induced chemotaxis of human eosinophils
J Med Chem 48: 2194-211 (2005)
Article DOI: 10.1021/jm049530m
BindingDB Entry DOI: 10.7270/Q2XP74F1