BDBM50163755 CHEMBL3799396
SMILES: CN1c2ccc(cc2CS1(=O)=O)-c1cncc(Cl)c1N1CCC2(CC1)C(C)=NNC2=O
InChI Key: InChIKey=YQYMAYUQUXDUNP-UHFFFAOYSA-N
Data: 1 IC50
Activity Spreadsheet -- Enzyme Inhibition Constant Data from BindingDB
Found 1 hit for monomerid = 50163755
Trg + Lig
Ki
nM
ΔG°
kcal/mole
IC50
nM
Kd
nM
EC50/IC50
nM
koff
s-1
kon
M-1s-1
pHTemp
°C
Cyclin-dependent kinase 8
(Homo sapiens (Human))
BDBM50163755
(CHEMBL3799396)
Show SMILES CN1c2ccc(cc2CS1(=O)=O)-c1cncc(Cl)c1N1CCC2(CC1)C(C)=NNC2=O |c:30|
Show InChI InChI=1S/C21H22ClN5O3S/c1-13-21(20(28)25-24-13)5-7-27(8-6-21)19-16(10-23-11-17(19)22)14-3-4-18-15(9-14)12-31(29,30)26(18)2/h3-4,9-11H,5-8,12H2,1-2H3,(H,25,28)
Reactome pathway
n/an/a 2.70n/an/an/an/an/an/a
The Institute of Cancer Research
Curated by ChEMBL
Assay Description
Binding affinity to His-tagged CDK8 (unknown origin) after 60 mins by FRET based lanthascreen binding assay
J Med Chem 59: 1078-101 (2016)
BindingDB Entry DOI: 10.7270/Q29025P6