BDBM50163811 5-Amino-3-[4-(4-chloro-phenoxy)-phenoxy]-3-(2-ethoxy-ethyl)-piperidine-2,4,6-trione::CHEMBL183216
SMILES: CCOCCC1(Oc2ccc(Oc3ccc(Cl)cc3)cc2)C(=O)NC(=O)C(N)C1=O
InChI Key: InChIKey=BGEFVHSKSARWDE-UHFFFAOYSA-N
Data: 2 IC50
Activity Spreadsheet -- Enzyme Inhibition Constant Data from BindingDB
Found 2 hits for monomerid = 50163811
Trg + Lig
Ki
nM
ΔG°
kcal/mole
IC50
nM
Kd
nM
EC50/IC50
nM
koff
s-1
kon
M-1s-1
pHTemp
°C
Collagenase 3
(Homo sapiens (Human))
BDBM50163811
(5-Amino-3-[4-(4-chloro-phenoxy)-phenoxy]-3-(2-etho...)
Show SMILES CCOCCC1(Oc2ccc(Oc3ccc(Cl)cc3)cc2)C(=O)NC(=O)C(N)C1=O
Show InChI InChI=1S/C21H21ClN2O6/c1-2-28-12-11-21(18(25)17(23)19(26)24-20(21)27)30-16-9-7-15(8-10-16)29-14-5-3-13(22)4-6-14/h3-10,17H,2,11-12,23H2,1H3,(H,24,26,27)
NCI pathway
Reactome pathway
n/an/a 1.40n/an/an/an/an/an/a
Pfizer Global Research and Development
Curated by ChEMBL
Assay Description
Inhibitory concentration against matrix metalloprotease 13
Bioorg Med Chem Lett 15: 1807-10 (2005)
Article DOI: 10.1016/j.bmcl.2005.02.038
BindingDB Entry DOI: 10.7270/Q2JH3KPW
Matrix metalloproteinase-14 (MMP14)
(Homo sapiens (Human))
BDBM50163811
(5-Amino-3-[4-(4-chloro-phenoxy)-phenoxy]-3-(2-etho...)
Show SMILES CCOCCC1(Oc2ccc(Oc3ccc(Cl)cc3)cc2)C(=O)NC(=O)C(N)C1=O
Show InChI InChI=1S/C21H21ClN2O6/c1-2-28-12-11-21(18(25)17(23)19(26)24-20(21)27)30-16-9-7-15(8-10-16)29-14-5-3-13(22)4-6-14/h3-10,17H,2,11-12,23H2,1H3,(H,24,26,27)
n/an/a 18n/an/an/an/an/an/a
Pfizer Global Research and Development
Curated by ChEMBL
Assay Description
Inhibitory concentration against matrix metalloprotease 14
Bioorg Med Chem Lett 15: 1807-10 (2005)
Article DOI: 10.1016/j.bmcl.2005.02.038
BindingDB Entry DOI: 10.7270/Q2JH3KPW