BDBM50164001 4-Benzenesulfonyl-4-o-tolyl-piperidine-1-carboxylic acid ethyl ester::CHEMBL183815
SMILES: CCOC(=O)N1CCC(CC1)(c1ccccc1C)S(=O)(=O)c1ccccc1
InChI Key: InChIKey=RNOBOZCHZUJUGJ-UHFFFAOYSA-N
Data: 1 EC50
Activity Spreadsheet -- Enzyme Inhibition Constant Data from BindingDB
Found 1 hit for monomerid = 50164001
Trg + Lig
Ki
nM
ΔG°
kcal/mole
IC50
nM
Kd
nM
EC50/IC50
nM
koff
s-1
kon
M-1s-1
pHTemp
°C
Beta amyloid A4 protein
(Homo sapiens (Human))
BDBM50164001
(4-Benzenesulfonyl-4-o-tolyl-piperidine-1-carboxyli...)
Show SMILES CCOC(=O)N1CCC(CC1)(c1ccccc1C)S(=O)(=O)c1ccccc1
Show InChI InChI=1S/C21H25NO4S/c1-3-26-20(23)22-15-13-21(14-16-22,19-12-8-7-9-17(19)2)27(24,25)18-10-5-4-6-11-18/h4-12H,3,13-16H2,1-2H3
Reactome pathway
n/an/an/an/a 4.86E+4n/an/an/an/a
Wyeth Research
Curated by ChEMBL
Assay Description
In vitro effective concentration against beta amyloid protein 40 in ELISA
Bioorg Med Chem Lett 15: 1891-4 (2005)
Article DOI: 10.1016/j.bmcl.2005.02.006
BindingDB Entry DOI: 10.7270/Q2N879B4