BDBM50164120 6-(2-Bromo-6-methyl-phenyl)-8-methyl-2-phenylamino-8H-pyrido[2,3-d]pyrimidin-7-one::CHEMBL180149
SMILES: Cc1cccc(Br)c1-c1cc2cnc(Nc3ccccc3)nc2n(C)c1=O
InChI Key: InChIKey=XFSDYEOOAZWMMS-UHFFFAOYSA-N
Data: 1 IC50
Activity Spreadsheet -- Enzyme Inhibition Constant Data from BindingDB
Found 1 hit for monomerid = 50164120
Trg + Lig
Ki
nM
ΔG°
kcal/mole
IC50
nM
Kd
nM
EC50/IC50
nM
koff
s-1
kon
M-1s-1
pHTemp
°C
Serine/threonine-protein kinase WEE1
(Homo sapiens (Human))
BDBM50164120
(6-(2-Bromo-6-methyl-phenyl)-8-methyl-2-phenylamino...)
Show SMILES Cc1cccc(Br)c1-c1cc2cnc(Nc3ccccc3)nc2n(C)c1=O |(2.57,3.45,;3.93,2.7,;5.23,3.48,;6.59,2.72,;6.59,1.18,;5.26,.4,;5.28,-1.15,;3.93,1.16,;2.61,.39,;1.27,1.16,;-.06,.37,;-1.39,1.14,;-2.72,.37,;-2.72,-1.17,;-4.05,-1.94,;-5.38,-1.17,;-5.38,.37,;-6.71,1.14,;-8.04,.34,;-8.03,-1.2,;-6.71,-1.97,;-1.39,-1.94,;-.06,-1.17,;1.29,-1.94,;1.29,-3.48,;2.62,-1.15,;3.95,-1.92,)|
Show InChI InChI=1S/C21H17BrN4O/c1-13-7-6-10-17(22)18(13)16-11-14-12-23-21(24-15-8-4-3-5-9-15)25-19(14)26(2)20(16)27/h3-12H,1-2H3,(H,23,24,25)
NCI pathway
Reactome pathway
n/an/a 4.50E+3n/an/an/an/an/an/a
University of Auckland
Curated by ChEMBL
Assay Description
Inhibition of checkpoint kinase Wee1
Bioorg Med Chem Lett 15: 1931-5 (2005)
Article DOI: 10.1016/j.bmcl.2005.01.079
BindingDB Entry DOI: 10.7270/Q280524M