BDBM50164123 6-(2-Chloro-phenyl)-2-[4-(2-diethylamino-ethoxy)-phenylamino]-5,8-dimethyl-8H-pyrido[2,3-d]pyrimidin-7-one::CHEMBL181017
SMILES: CCN(CC)CCOc1ccc(Nc2ncc3c(C)c(-c4ccccc4Cl)c(=O)n(C)c3n2)cc1
InChI Key: InChIKey=XPRLKGXPWFZGHU-UHFFFAOYSA-N
Data: 1 IC50
Activity Spreadsheet -- Enzyme Inhibition Constant Data from BindingDB
Found 1 hit for monomerid = 50164123
Trg + Lig
Ki
nM
ΔG°
kcal/mole
IC50
nM
Kd
nM
EC50/IC50
nM
koff
s-1
kon
M-1s-1
pHTemp
°C
Serine/threonine-protein kinase WEE1
(Homo sapiens (Human))
BDBM50164123
(6-(2-Chloro-phenyl)-2-[4-(2-diethylamino-ethoxy)-p...)
Show SMILES CCN(CC)CCOc1ccc(Nc2ncc3c(C)c(-c4ccccc4Cl)c(=O)n(C)c3n2)cc1 |(-10.91,3.89,;-9.58,4.67,;-8.25,3.89,;-6.91,4.67,;-5.57,3.91,;-8.23,2.36,;-6.9,1.6,;-6.9,.06,;-5.57,-.71,;-5.54,-2.27,;-4.21,-3.02,;-2.91,-2.24,;-1.56,-3.02,;-.23,-2.24,;-.23,-.68,;1.1,.09,;2.43,-.68,;3.76,.09,;3.74,1.63,;5.09,-.68,;6.42,.11,;7.75,-.66,;9.08,.12,;9.08,1.65,;7.73,2.42,;6.4,1.63,;5.07,2.28,;5.09,-2.22,;6.45,-2.99,;3.76,-2.99,;3.76,-4.55,;2.43,-2.24,;1.1,-3.02,;-2.89,-.71,;-4.24,.07,)|
Show InChI InChI=1S/C27H30ClN5O2/c1-5-33(6-2)15-16-35-20-13-11-19(12-14-20)30-27-29-17-22-18(3)24(21-9-7-8-10-23(21)28)26(34)32(4)25(22)31-27/h7-14,17H,5-6,15-16H2,1-4H3,(H,29,30,31)
NCI pathway
Reactome pathway
n/an/a 550n/an/an/an/an/an/a
University of Auckland
Curated by ChEMBL
Assay Description
Inhibition of checkpoint kinase Wee1
Bioorg Med Chem Lett 15: 1931-5 (2005)
Article DOI: 10.1016/j.bmcl.2005.01.079
BindingDB Entry DOI: 10.7270/Q280524M