BDBM50164154 6-(2-Chloro-6-hydroxy-phenyl)-8-methyl-2-phenylamino-8H-pyrido[2,3-d]pyrimidin-7-one::CHEMBL434907
SMILES: Cn1c2nc(Nc3ccccc3)ncc2cc(-c2c(O)cccc2Cl)c1=O
InChI Key: InChIKey=STUQOPOHRUSKOD-UHFFFAOYSA-N
Data: 1 IC50
Activity Spreadsheet -- Enzyme Inhibition Constant Data from BindingDB
Found 1 hit for monomerid = 50164154
Trg + Lig
Ki
nM
ΔG°
kcal/mole
IC50
nM
Kd
nM
EC50/IC50
nM
koff
s-1
kon
M-1s-1
pHTemp
°C
Serine/threonine-protein kinase WEE1
(Homo sapiens (Human))
BDBM50164154
(6-(2-Chloro-6-hydroxy-phenyl)-8-methyl-2-phenylami...)
Show SMILES Cn1c2nc(Nc3ccccc3)ncc2cc(-c2c(O)cccc2Cl)c1=O |(1.29,-3.48,;1.29,-1.94,;-.06,-1.17,;-1.39,-1.94,;-2.72,-1.17,;-4.05,-1.94,;-5.38,-1.17,;-5.38,.37,;-6.71,1.14,;-8.04,.34,;-8.03,-1.2,;-6.71,-1.97,;-2.72,.37,;-1.39,1.14,;-.06,.37,;1.27,1.16,;2.61,.39,;3.93,1.16,;5.26,.4,;5.28,-1.15,;6.59,1.18,;6.59,2.72,;5.23,3.48,;3.93,2.7,;2.57,3.45,;2.62,-1.15,;3.95,-1.92,)|
Show InChI InChI=1S/C20H15ClN4O2/c1-25-18-12(11-22-20(24-18)23-13-6-3-2-4-7-13)10-14(19(25)27)17-15(21)8-5-9-16(17)26/h2-11,26H,1H3,(H,22,23,24)
NCI pathway
Reactome pathway
n/an/a 1.50E+3n/an/an/an/an/an/a
University of Auckland
Curated by ChEMBL
Assay Description
Inhibition of checkpoint kinase Wee1
Bioorg Med Chem Lett 15: 1931-5 (2005)
Article DOI: 10.1016/j.bmcl.2005.01.079
BindingDB Entry DOI: 10.7270/Q280524M