BDBM50164217 CHEMBL192660::N*1*-Imidazo[1,2-d][1,2,4]thiadiazol-3-yl-hexane-1,6-diamine
SMILES: NCCCCCCNc1nsc2nccn12
InChI Key: InChIKey=LFQZVAJZFDJDEG-UHFFFAOYSA-N
Data: 1 IC50
Activity Spreadsheet -- Enzyme Inhibition Constant Data from BindingDB
Found 1 hit for monomerid = 50164217
Trg + Lig
Ki
nM
ΔG°
kcal/mole
IC50
nM
Kd
nM
EC50/IC50
nM
koff
s-1
kon
M-1s-1
pHTemp
°C
Coagulation factor XIII
(Homo sapiens (Human))
BDBM50164217
(CHEMBL192660 | N*1*-Imidazo[1,2-d][1,2,4]thiadiazo...)
Show SMILES NCCCCCCNc1nsc2nccn12
Show InChI InChI=1S/C10H17N5S/c11-5-3-1-2-4-6-12-9-14-16-10-13-7-8-15(9)10/h7-8H,1-6,11H2,(H,12,14)
Reactome pathway
n/an/a 1.10E+4n/an/an/an/an/an/a
Apotex Research Inc.
Curated by ChEMBL
Assay Description
In vitro inhibitory concentration of compound against factor XIIIa
J Med Chem 48: 2266-9 (2005)
Article DOI: 10.1021/jm049221w
BindingDB Entry DOI: 10.7270/Q2R210XM