BDBM50164221 CHEMBL189379::N-[6-(Imidazo[1,2-d][1,2,4]thiadiazol-3-ylamino)-hexyl]-4-methyl-benzenesulfonamide
SMILES: Cc1ccc(cc1)S(=O)(=O)NCCCCCCNc1nsc2nccn12
InChI Key: InChIKey=XWNIGYVLQLWABJ-UHFFFAOYSA-N
Data: 1 IC50
Activity Spreadsheet -- Enzyme Inhibition Constant Data from BindingDB
Found 1 hit for monomerid = 50164221
Trg + Lig
Ki
nM
ΔG°
kcal/mole
IC50
nM
Kd
nM
EC50/IC50
nM
koff
s-1
kon
M-1s-1
pHTemp
°C
Coagulation factor XIII
(Homo sapiens (Human))
BDBM50164221
(CHEMBL189379 | N-[6-(Imidazo[1,2-d][1,2,4]thiadiaz...)
Show SMILES Cc1ccc(cc1)S(=O)(=O)NCCCCCCNc1nsc2nccn12
Show InChI InChI=1S/C17H23N5O2S2/c1-14-6-8-15(9-7-14)26(23,24)20-11-5-3-2-4-10-18-16-21-25-17-19-12-13-22(16)17/h6-9,12-13,20H,2-5,10-11H2,1H3,(H,18,21)
Reactome pathway
n/an/a 2.20E+3n/an/an/an/an/an/a
Apotex Research Inc.
Curated by ChEMBL
Assay Description
In vitro inhibitory concentration of compound against factor XIIIa
J Med Chem 48: 2266-9 (2005)
Article DOI: 10.1021/jm049221w
BindingDB Entry DOI: 10.7270/Q2R210XM