BDBM50164235 6-[2-tert-Butyl-5-(4-fluoro-phenyl)-3H-imidazol-4-yl]-1-(propane-2-sulfonyl)-1H-benzoimidazol-2-ylamine; Bismesylate salt::CHEMBL193055
SMILES: CC(C)S(=O)(=O)n1c(N)nc2ccc(cc12)-c1nc([nH]c1-c1ccc(F)cc1)C(C)(C)C
InChI Key: InChIKey=ABAOSSRHMRVEJF-UHFFFAOYSA-N
Data: 2 IC50
Activity Spreadsheet -- Enzyme Inhibition Constant Data from BindingDB
Found 2 hits for monomerid = 50164235
Trg + Lig
Ki
nM
ΔG°
kcal/mole
IC50
nM
Kd
nM
EC50/IC50
nM
koff
s-1
kon
M-1s-1
pHTemp
°C
Cytochrome P450 3A4
(Homo sapiens (Human))
BDBM50164235
(6-[2-tert-Butyl-5-(4-fluoro-phenyl)-3H-imidazol-4-...)
Show SMILES CC(C)S(=O)(=O)n1c(N)nc2ccc(cc12)-c1nc([nH]c1-c1ccc(F)cc1)C(C)(C)C
Show InChI InChI=1S/C23H26FN5O2S/c1-13(2)32(30,31)29-18-12-15(8-11-17(18)26-22(29)25)20-19(14-6-9-16(24)10-7-14)27-21(28-20)23(3,4)5/h6-13H,1-5H3,(H2,25,26)(H,27,28)
Reactome pathway
n/an/a 3.18E+4n/an/an/an/an/an/a
Eli Lilly and Co.
Curated by ChEMBL
Assay Description
In vitro inhibitory concentration against Cytochrome P450 3A4
J Med Chem 48: 2270-3 (2005)
Article DOI: 10.1021/jm048978k
BindingDB Entry DOI: 10.7270/Q2M90869
Mitogen-activated protein kinase 14
(Homo sapiens (Human))
BDBM50164235
(6-[2-tert-Butyl-5-(4-fluoro-phenyl)-3H-imidazol-4-...)
Show SMILES CC(C)S(=O)(=O)n1c(N)nc2ccc(cc12)-c1nc([nH]c1-c1ccc(F)cc1)C(C)(C)C
Show InChI InChI=1S/C23H26FN5O2S/c1-13(2)32(30,31)29-18-12-15(8-11-17(18)26-22(29)25)20-19(14-6-9-16(24)10-7-14)27-21(28-20)23(3,4)5/h6-13H,1-5H3,(H2,25,26)(H,27,28)
NCI pathway
Reactome pathway
n/an/a 15.9n/an/an/an/an/an/a
Eli Lilly and Co.
Curated by ChEMBL
Assay Description
Inhibition of human recombinant Mitogen activated protein kinase p38 alpha activity using ATP[gamma-33P] and EGFR 21mer-peptide
J Med Chem 48: 2270-3 (2005)
Article DOI: 10.1021/jm048978k
BindingDB Entry DOI: 10.7270/Q2M90869