BDBM50164500 CHEMBL3800091
SMILES: CC(C)Cc1onc(-c2nc(no2)-c2ccc(CN3CC(C3)C(O)=O)cc2)c1C(F)(F)F
InChI Key: InChIKey=KKZAKGKOIPIRBJ-UHFFFAOYSA-N
Data: 2 EC50
Activity Spreadsheet -- Enzyme Inhibition Constant Data from BindingDB
Found 2 hits for monomerid = 50164500
Trg + Lig
Ki
nM
ΔG°
kcal/mole
IC50
nM
Kd
nM
EC50/IC50
nM
koff
s-1
kon
M-1s-1
pHTemp
°C
Sphingosine 1-phosphate receptor 3
(Homo sapiens (Human))
BDBM50164500
(CHEMBL3800091)
Show SMILES CC(C)Cc1onc(-c2nc(no2)-c2ccc(CN3CC(C3)C(O)=O)cc2)c1C(F)(F)F
Show InChI InChI=1S/C21H21F3N4O4/c1-11(2)7-15-16(21(22,23)24)17(26-31-15)19-25-18(27-32-19)13-5-3-12(4-6-13)8-28-9-14(10-28)20(29)30/h3-6,11,14H,7-10H2,1-2H3,(H,29,30)
NCI pathway
Reactome pathway
n/an/an/an/a 6.20E+3n/an/an/an/a
Bristol-Myers Squibb Research and Development
Curated by ChEMBL
Assay Description
Agonist activity at human S1P3 receptor expressed in EDG3-Ga15-bla HEK293T cell membranes after 45 mins by [35S]-GTPgammaS binding assay
J Med Chem 59: 2820-40 (2016)
BindingDB Entry DOI: 10.7270/Q2HH6N0K
Sphingosine 1-phosphate receptor 1
(Homo sapiens (Human))
BDBM50164500
(CHEMBL3800091)
Show SMILES CC(C)Cc1onc(-c2nc(no2)-c2ccc(CN3CC(C3)C(O)=O)cc2)c1C(F)(F)F
Show InChI InChI=1S/C21H21F3N4O4/c1-11(2)7-15-16(21(22,23)24)17(26-31-15)19-25-18(27-32-19)13-5-3-12(4-6-13)8-28-9-14(10-28)20(29)30/h3-6,11,14H,7-10H2,1-2H3,(H,29,30)
Reactome pathway
n/an/an/an/a 0.390n/an/an/an/a
Bristol-Myers Squibb Research and Development
Curated by ChEMBL
Assay Description
Agonist activity at human S1P1 receptor expressed in CHO cell membranes after 45 mins by [35S]-GTPgammaS binding assay
J Med Chem 59: 2820-40 (2016)
BindingDB Entry DOI: 10.7270/Q2HH6N0K