BDBM50164505 CHEMBL3797680
SMILES: [H][C@@]12CN(C[C@@]1(NC(=N)N(C)C2=O)c1ccc(s1)C#N)c1nc(C)c(F)c(SC)n1
InChI Key: InChIKey=RVOBSBJZKQOYEK-VOJFVSQTSA-N
Data: 1 KI  1 IC50
PDB links: 1 PDB ID matches this monomer.
Activity Spreadsheet -- Enzyme Inhibition Constant Data from BindingDB
Found 2 hits for monomerid = 50164505
Trg + Lig
Ki
nM
ΔG°
kcal/mole
IC50
nM
Kd
nM
EC50/IC50
nM
koff
s-1
kon
M-1s-1
pHTemp
°C
Beta-secretase 1
(Homo sapiens (Human))
BDBM50164505
(CHEMBL3797680)
Show SMILES [H][C@@]12CN(C[C@@]1(NC(=N)N(C)C2=O)c1ccc(s1)C#N)c1nc(C)c(F)c(SC)n1 |r|
Show InChI InChI=1S/C18H18FN7OS2/c1-9-13(19)14(28-3)23-17(22-9)26-7-11-15(27)25(2)16(21)24-18(11,8-26)12-5-4-10(6-20)29-12/h4-5,11H,7-8H2,1-3H3,(H2,21,24)/t11-,18-/m0/s1
45n/an/an/an/an/an/an/an/a
Merck Research Laboratories
Curated by ChEMBL
Assay Description
Inhibition of recombinant human BACE1 preincubated for 30 mins followed QSY7EISEVNLDAEFC-Eu-amide substrate addition measured after 90 mins by FRET a...
J Med Chem 59: 3231-48 (2016)
BindingDB Entry DOI: 10.7270/Q2CR5W8V
Beta-secretase 1
(Homo sapiens (Human))
BDBM50164505
(CHEMBL3797680)
Show SMILES [H][C@@]12CN(C[C@@]1(NC(=N)N(C)C2=O)c1ccc(s1)C#N)c1nc(C)c(F)c(SC)n1 |r|
Show InChI InChI=1S/C18H18FN7OS2/c1-9-13(19)14(28-3)23-17(22-9)26-7-11-15(27)25(2)16(21)24-18(11,8-26)12-5-4-10(6-20)29-12/h4-5,11H,7-8H2,1-3H3,(H2,21,24)/t11-,18-/m0/s1
n/an/a 36n/an/an/an/an/an/a
Merck Research Laboratories
Curated by ChEMBL
Assay Description
Inhibition of BACE1 in human HEK293 cells transfected with human APP Swe/Lon mutations assessed as amyloid beta 40 level after 4 hrs by electrochemil...
J Med Chem 59: 3231-48 (2016)
BindingDB Entry DOI: 10.7270/Q2CR5W8V