BDBM50164506 CHEMBL3799339
SMILES: [H][C@@]12CN(C[C@@]1(NC(=N)N(C)C2=O)c1ccc(s1)C#N)c1nc(C)c(F)c(OCC)n1
InChI Key: InChIKey=NAIWJSDALLQSJO-BUXKBTBVSA-N
Data: 1 KI  1 IC50
PDB links: 1 PDB ID matches this monomer.
Activity Spreadsheet -- Enzyme Inhibition Constant Data from BindingDB
Found 2 hits for monomerid = 50164506
Trg + Lig
Ki
nM
ΔG°
kcal/mole
IC50
nM
Kd
nM
EC50/IC50
nM
koff
s-1
kon
M-1s-1
pHTemp
°C
Beta-secretase 1
(Homo sapiens (Human))
BDBM50164506
(CHEMBL3799339)
Show SMILES [H][C@@]12CN(C[C@@]1(NC(=N)N(C)C2=O)c1ccc(s1)C#N)c1nc(C)c(F)c(OCC)n1 |r|
Show InChI InChI=1S/C19H20FN7O2S/c1-4-29-15-14(20)10(2)23-18(24-15)27-8-12-16(28)26(3)17(22)25-19(12,9-27)13-6-5-11(7-21)30-13/h5-6,12H,4,8-9H2,1-3H3,(H2,22,25)/t12-,19-/m0/s1
48n/an/an/an/an/an/an/an/a
Merck Research Laboratories
Curated by ChEMBL
Assay Description
Inhibition of recombinant human BACE1 preincubated for 30 mins followed QSY7EISEVNLDAEFC-Eu-amide substrate addition measured after 90 mins by FRET a...
J Med Chem 59: 3231-48 (2016)
BindingDB Entry DOI: 10.7270/Q2CR5W8V
Beta-secretase 1
(Homo sapiens (Human))
BDBM50164506
(CHEMBL3799339)
Show SMILES [H][C@@]12CN(C[C@@]1(NC(=N)N(C)C2=O)c1ccc(s1)C#N)c1nc(C)c(F)c(OCC)n1 |r|
Show InChI InChI=1S/C19H20FN7O2S/c1-4-29-15-14(20)10(2)23-18(24-15)27-8-12-16(28)26(3)17(22)25-19(12,9-27)13-6-5-11(7-21)30-13/h5-6,12H,4,8-9H2,1-3H3,(H2,22,25)/t12-,19-/m0/s1
n/an/a 361n/an/an/an/an/an/a
Merck Research Laboratories
Curated by ChEMBL
Assay Description
Inhibition of BACE1 in human HEK293 cells transfected with human APP Swe/Lon mutations assessed as amyloid beta 40 level after 4 hrs by electrochemil...
J Med Chem 59: 3231-48 (2016)
BindingDB Entry DOI: 10.7270/Q2CR5W8V