BDBM50164641 CHEMBL3797843
SMILES: ONC(=O)c1ccc(Cl)c(NC(=O)c2ccccc2)c1
InChI Key: InChIKey=BBBOKCZDRCMPOZ-UHFFFAOYSA-N
Data: 5 IC50
PDB links: 1 PDB ID matches this monomer.
Activity Spreadsheet -- Enzyme Inhibition Constant Data from BindingDB
Found 5 hits for monomerid = 50164641
Trg + Lig
Ki
nM
ΔG°
kcal/mole
IC50
nM
Kd
nM
EC50/IC50
nM
koff
s-1
kon
M-1s-1
pHTemp
°C
Cereblon/Histone deacetylase 6
(Homo sapiens (Human))
BDBM50164641
(CHEMBL3797843)
Show SMILES ONC(=O)c1ccc(Cl)c(NC(=O)c2ccccc2)c1
Show InChI InChI=1S/C14H11ClN2O3/c15-11-7-6-10(14(19)17-20)8-12(11)16-13(18)9-4-2-1-3-5-9/h1-8,20H,(H,16,18)(H,17,19)
NCI pathway
Reactome pathway
n/an/a 120n/an/an/an/an/an/a
Martin-Luther University of Halle-Wittenberg
Curated by ChEMBL
Assay Description
Inhibition of recombinant human HDAC6 using Cbz-(Ac)Lys-AMC as substrate preincubated for 90 mins followed by trypsin addition measured after 20 mins...
J Med Chem 59: 2423-35 (2016)
BindingDB Entry DOI: 10.7270/Q28054HC
Histone deacetylase 8
(Homo sapiens (Human))
BDBM50164641
(CHEMBL3797843)
Show SMILES ONC(=O)c1ccc(Cl)c(NC(=O)c2ccccc2)c1
Show InChI InChI=1S/C14H11ClN2O3/c15-11-7-6-10(14(19)17-20)8-12(11)16-13(18)9-4-2-1-3-5-9/h1-8,20H,(H,16,18)(H,17,19)
NCI pathway
Reactome pathway
n/an/a 120n/an/an/an/an/an/a
Martin-Luther University of Halle-Wittenberg
Curated by ChEMBL
Assay Description
Inhibition of recombinant human HDAC8 using Fluor de Lys as substrate preincubated for 90 mins followed by BML-KI176 addition measured after 45 mins ...
J Med Chem 59: 2423-35 (2016)
BindingDB Entry DOI: 10.7270/Q28054HC
Histone deacetylase 8
(Schistosoma mansoni)
BDBM50164641
(CHEMBL3797843)
Show SMILES ONC(=O)c1ccc(Cl)c(NC(=O)c2ccccc2)c1
Show InChI InChI=1S/C14H11ClN2O3/c15-11-7-6-10(14(19)17-20)8-12(11)16-13(18)9-4-2-1-3-5-9/h1-8,20H,(H,16,18)(H,17,19)
n/an/a 68n/an/an/an/an/an/a
Washington University School of Medicine
Curated by ChEMBL
Assay Description
Inhibition of Schistosoma mansoni KDAC8 using (FAM)-labeled peptide as substrate after 60 mins by microfluidic assay
Bioorg Med Chem 25: 2105-2132 (2017)
Article DOI: 10.1016/j.bmc.2017.02.020
BindingDB Entry DOI: 10.7270/Q2PG1V0C
3D
3D Structure (crystal)
Histone deacetylase 8
(Schistosoma mansoni)
BDBM50164641
(CHEMBL3797843)
Show SMILES ONC(=O)c1ccc(Cl)c(NC(=O)c2ccccc2)c1
Show InChI InChI=1S/C14H11ClN2O3/c15-11-7-6-10(14(19)17-20)8-12(11)16-13(18)9-4-2-1-3-5-9/h1-8,20H,(H,16,18)(H,17,19)
n/an/a 67n/an/an/an/an/an/a
Martin-Luther University of Halle-Wittenberg
Curated by ChEMBL
Assay Description
Inhibition of recombinant Schistosoma mansoni HDAC8 expressed in Escherichia coli using Fluor de Lys as substrate preincubated for 90 mins followed b...
J Med Chem 59: 2423-35 (2016)
BindingDB Entry DOI: 10.7270/Q28054HC
3D
3D Structure (crystal)
Histone deacetylase 1
(Homo sapiens (Human))
BDBM50164641
(CHEMBL3797843)
Show SMILES ONC(=O)c1ccc(Cl)c(NC(=O)c2ccccc2)c1
Show InChI InChI=1S/C14H11ClN2O3/c15-11-7-6-10(14(19)17-20)8-12(11)16-13(18)9-4-2-1-3-5-9/h1-8,20H,(H,16,18)(H,17,19)
NCI pathway
Reactome pathway
n/an/a 1.16E+4n/an/an/an/an/an/a
Martin-Luther University of Halle-Wittenberg
Curated by ChEMBL
Assay Description
Inhibition of recombinant human HDAC1 using Cbz-(Ac)Lys-AMC as substrate preincubated for 90 mins followed by trypsin addition measured after 20 mins...
J Med Chem 59: 2423-35 (2016)
BindingDB Entry DOI: 10.7270/Q28054HC