BDBM50164670 CHEMBL3799597
SMILES: Nc1ccc(CNC(=O)NCC(=O)N2CCC[C@@H]2c2ccccc2Br)cc1
InChI Key: InChIKey=QASXSMHVNVTEBM-GOSISDBHSA-N
Data: 1 KI  1 Kd
PDB links: 1 PDB ID matches this monomer.
Activity Spreadsheet -- Enzyme Inhibition Constant Data from BindingDB
Found 2 hits for monomerid = 50164670
Trg + Lig
Ki
nM
ΔG°
kcal/mole
IC50
nM
Kd
nM
EC50/IC50
nM
koff
s-1
kon
M-1s-1
pHTemp
°C
Peptidyl-prolyl cis-trans isomerase D
(Homo sapiens (Human))
BDBM50164670
(CHEMBL3799597)
Show SMILES Nc1ccc(CNC(=O)NCC(=O)N2CCC[C@@H]2c2ccccc2Br)cc1 |r|
Show InChI InChI=1S/C20H23BrN4O2/c21-17-5-2-1-4-16(17)18-6-3-11-25(18)19(26)13-24-20(27)23-12-14-7-9-15(22)10-8-14/h1-2,4-5,7-10,18H,3,6,11-13,22H2,(H2,23,24,27)/t18-/m1/s1
950n/an/an/an/an/an/an/an/a
University of Liverpool
Curated by ChEMBL
Assay Description
Inhibition of Cyclophilin D (unknown origin) activity preincubated for 15 mins followed Suc-AAPF-pNA substrate addition by chymotrypsin coupled based...
J Med Chem 59: 2596-611 (2016)
BindingDB Entry DOI: 10.7270/Q2474CR6
Peptidyl-prolyl cis-trans isomerase D
(Homo sapiens (Human))
BDBM50164670
(CHEMBL3799597)
Show SMILES Nc1ccc(CNC(=O)NCC(=O)N2CCC[C@@H]2c2ccccc2Br)cc1 |r|
Show InChI InChI=1S/C20H23BrN4O2/c21-17-5-2-1-4-16(17)18-6-3-11-25(18)19(26)13-24-20(27)23-12-14-7-9-15(22)10-8-14/h1-2,4-5,7-10,18H,3,6,11-13,22H2,(H2,23,24,27)/t18-/m1/s1
n/an/an/a 1.20E+3n/an/an/an/an/a
University of Liverpool
Curated by ChEMBL
Assay Description
Binding affinity to Cyclophilin D (unknown origin) by isothermal titration calorimetry
J Med Chem 59: 2596-611 (2016)
BindingDB Entry DOI: 10.7270/Q2474CR6