BDBM50164795 CHEMBL3799608
SMILES: CN1CCN(CC1)c1ccc(cc1NC(=O)c1c[nH]c(=O)cc1C(F)(F)F)-c1ccc(NC(C)=O)nc1
InChI Key: InChIKey=OJAXIKLEQGASLZ-UHFFFAOYSA-N
Data: 1 Kd
Activity Spreadsheet -- Enzyme Inhibition Constant Data from BindingDB
Found 1 hit for monomerid = 50164795
Trg + Lig
Ki
nM
ΔG°
kcal/mole
IC50
nM
Kd
nM
EC50/IC50
nM
koff
s-1
kon
M-1s-1
pHTemp
°C
WD repeat-containing protein 5 (WDR5)
(Homo sapiens (Human))
BDBM50164795
(CHEMBL3799608)
Show SMILES CN1CCN(CC1)c1ccc(cc1NC(=O)c1c[nH]c(=O)cc1C(F)(F)F)-c1ccc(NC(C)=O)nc1
Show InChI InChI=1S/C25H25F3N6O3/c1-15(35)31-22-6-4-17(13-29-22)16-3-5-21(34-9-7-33(2)8-10-34)20(11-16)32-24(37)18-14-30-23(36)12-19(18)25(26,27)28/h3-6,11-14H,7-10H2,1-2H3,(H,30,36)(H,32,37)(H,29,31,35)
n/an/an/a 30n/an/an/an/an/a
Ontario Institute for Cancer Research
Curated by ChEMBL
Assay Description
Binding affinity to human poly His-tagged WDR5 (1 to 334 residues) expressed in Escherichia coli BL21(DE3)-V2R-pRARE2 cells by surface plasmon resona...
J Med Chem 59: 2478-96 (2016)
BindingDB Entry DOI: 10.7270/Q2VT1V0C