BDBM50164816 CHEMBL3799580
SMILES: CCc1cc(cc(OC2CCC2)n1)-c1nc(no1)-c1cc(C)c(OC[C@@H](O)CNC(=O)CO)c(CC)c1
InChI Key: InChIKey=KFHYAYZGRHBWCJ-NRFANRHFSA-N
Data: 2 EC50
Activity Spreadsheet -- Enzyme Inhibition Constant Data from BindingDB
Found 2 hits for monomerid = 50164816
Trg + Lig
Ki
nM
ΔG°
kcal/mole
IC50
nM
Kd
nM
EC50/IC50
nM
koff
s-1
kon
M-1s-1
pHTemp
°C
Sphingosine 1-phosphate receptor 3
(Homo sapiens (Human))
BDBM50164816
(CHEMBL3799580)
Show SMILES CCc1cc(cc(OC2CCC2)n1)-c1nc(no1)-c1cc(C)c(OC[C@@H](O)CNC(=O)CO)c(CC)c1 |r|
Show InChI InChI=1S/C27H34N4O6/c1-4-17-10-18(9-16(3)25(17)35-15-21(33)13-28-23(34)14-32)26-30-27(37-31-26)19-11-20(5-2)29-24(12-19)36-22-7-6-8-22/h9-12,21-22,32-33H,4-8,13-15H2,1-3H3,(H,28,34)/t21-/m0/s1
NCI pathway
Reactome pathway
n/an/an/an/a 55n/an/an/an/a
Actelion Pharmaceuticals Ltd.
Curated by ChEMBL
Assay Description
Agonist activity at human recombinant S1PR3 expressed in CHO cell membranes incubated for 30 mins by [35S]GTPgammaS binding assay in presence of GDP
Eur J Med Chem 115: 326-41 (2016)
BindingDB Entry DOI: 10.7270/Q2M90BK2
Sphingosine 1-phosphate receptor 1
(Homo sapiens (Human))
BDBM50164816
(CHEMBL3799580)
Show SMILES CCc1cc(cc(OC2CCC2)n1)-c1nc(no1)-c1cc(C)c(OC[C@@H](O)CNC(=O)CO)c(CC)c1 |r|
Show InChI InChI=1S/C27H34N4O6/c1-4-17-10-18(9-16(3)25(17)35-15-21(33)13-28-23(34)14-32)26-30-27(37-31-26)19-11-20(5-2)29-24(12-19)36-22-7-6-8-22/h9-12,21-22,32-33H,4-8,13-15H2,1-3H3,(H,28,34)/t21-/m0/s1
Reactome pathway
n/an/an/an/a 1.10n/an/an/an/a
Actelion Pharmaceuticals Ltd.
Curated by ChEMBL
Assay Description
Agonist activity at human recombinant S1PR1 expressed in CHO cell membranes incubated for 30 mins by [35S]GTPgammaS binding assay in presence of GDP
Eur J Med Chem 115: 326-41 (2016)
BindingDB Entry DOI: 10.7270/Q2M90BK2