BDBM50165116 CHEMBL194007::tetrasodium ({[(2R,3R,5R)-5-(2-amino-6-hydroxy-9H-purin-9-yl)-3-hydroxyoxolan-2-yl]methyl phosphonato}oxy)(phosphonatooxy)phosphinate
SMILES: Nc1nc2n(cnc2c(=O)[nH]1)[C@H]1C[C@@H](O)[C@@H](COP([O-])(=O)OP([O-])(=O)OP([O-])([O-])=O)O1
InChI Key: InChIKey=HAAZLUGHYHWQIW-HSUXUTPPSA-J
Data: 1 IC50
Activity Spreadsheet -- Enzyme Inhibition Constant Data from BindingDB
Found 1 hit for monomerid = 50165116
Trg + Lig
Ki
nM
ΔG°
kcal/mole
IC50
nM
Kd
nM
EC50/IC50
nM
koff
s-1
kon
M-1s-1
pHTemp
°C
Eukaryotic translation initiation factor 4E (eIF4E)
(Homo sapiens (Human))
BDBM50165116
(CHEMBL194007 | tetrasodium ({[(2R,3R,5R)-5-(2-amin...)
Show SMILES Nc1nc2n(cnc2c(=O)[nH]1)[C@H]1C[C@@H](O)[C@@H](COP([O-])(=O)OP([O-])(=O)OP([O-])([O-])=O)O1
Show InChI InChI=1S/C10H16N5O13P3/c11-10-13-8-7(9(17)14-10)12-3-15(8)6-1-4(16)5(26-6)2-25-30(21,22)28-31(23,24)27-29(18,19)20/h3-6,16H,1-2H2,(H,21,22)(H,23,24)(H2,18,19,20)(H3,11,13,14,17)/p-4/t4-,5-,6-/m1/s1
n/an/a>4.00E+5n/an/an/an/an/an/a
University of Minnesota
Curated by ChEMBL
Assay Description
Inhibitory concentration against 7-methyl-GTP binding to eukaryotic translation initiation factor 4E
Bioorg Med Chem Lett 15: 2177-80 (2005)
Article DOI: 10.1016/j.bmcl.2005.01.080
BindingDB Entry DOI: 10.7270/Q27D2VWP