BDBM50165293 8-(2-Chloro-3,4,5-trimethoxy-phenylsulfanyl)-9-pent-4-ynyl-9H-purin-6-ylamine::CHEMBL192647
SMILES: COc1cc(Sc2nc3c(N)ncnc3n2CCCC#C)c(Cl)c(OC)c1OC
InChI Key: InChIKey=FJDWNDYYMRLXGQ-UHFFFAOYSA-N
Data: 1 IC50  4 EC50
Activity Spreadsheet -- Enzyme Inhibition Constant Data from BindingDB
Found 5 hits for monomerid = 50165293
Trg + Lig
Ki
nM
ΔG°
kcal/mole
IC50
nM
Kd
nM
EC50/IC50
nM
koff
s-1
kon
M-1s-1
pHTemp
°C
Heat shock protein HSP 90-alpha
(Homo sapiens (Human))
BDBM50165293
(8-(2-Chloro-3,4,5-trimethoxy-phenylsulfanyl)-9-pen...)
Show SMILES COc1cc(Sc2nc3c(N)ncnc3n2CCCC#C)c(Cl)c(OC)c1OC
Show InChI InChI=1S/C19H20ClN5O3S/c1-5-6-7-8-25-18-14(17(21)22-10-23-18)24-19(25)29-12-9-11(26-2)15(27-3)16(28-4)13(12)20/h1,9-10H,6-8H2,2-4H3,(H2,21,22,23)
NCI pathway
Reactome pathway
n/an/an/an/a 1.82E+4n/an/an/an/a
Memorial Sloan-Kettering Cancer Center
Curated by ChEMBL
Assay Description
Effective concentration of compound against heat shock protein HSP90 determined in normal heart cells
J Med Chem 48: 2892-905 (2005)
Article DOI: 10.1021/jm049012b
BindingDB Entry DOI: 10.7270/Q2N29WF6
Heat shock protein HSP 90-alpha
(Mus musculus)
BDBM50165293
(8-(2-Chloro-3,4,5-trimethoxy-phenylsulfanyl)-9-pen...)
Show SMILES COc1cc(Sc2nc3c(N)ncnc3n2CCCC#C)c(Cl)c(OC)c1OC
Show InChI InChI=1S/C19H20ClN5O3S/c1-5-6-7-8-25-18-14(17(21)22-10-23-18)24-19(25)29-12-9-11(26-2)15(27-3)16(28-4)13(12)20/h1,9-10H,6-8H2,2-4H3,(H2,21,22,23)
Reactome pathway
n/an/an/an/a 180n/an/an/an/a
Memorial Sloan-Kettering Cancer Center
Curated by ChEMBL
Assay Description
Displacement of 5 nM GM-BODIPY from mouse heat shock protein HSP90-alpha
J Med Chem 48: 2892-905 (2005)
Article DOI: 10.1021/jm049012b
BindingDB Entry DOI: 10.7270/Q2N29WF6
Heat shock protein HSP 90-alpha
(Homo sapiens (Human))
BDBM50165293
(8-(2-Chloro-3,4,5-trimethoxy-phenylsulfanyl)-9-pen...)
Show SMILES COc1cc(Sc2nc3c(N)ncnc3n2CCCC#C)c(Cl)c(OC)c1OC
Show InChI InChI=1S/C19H20ClN5O3S/c1-5-6-7-8-25-18-14(17(21)22-10-23-18)24-19(25)29-12-9-11(26-2)15(27-3)16(28-4)13(12)20/h1,9-10H,6-8H2,2-4H3,(H2,21,22,23)
NCI pathway
Reactome pathway
n/an/an/an/a>7.50E+4n/an/an/an/a
Memorial Sloan-Kettering Cancer Center
Curated by ChEMBL
Assay Description
Effective concentration of compound against heat shock protein HSP90 determined in normal lung cells
J Med Chem 48: 2892-905 (2005)
Article DOI: 10.1021/jm049012b
BindingDB Entry DOI: 10.7270/Q2N29WF6
Heat shock protein HSP 90-alpha
(Homo sapiens (Human))
BDBM50165293
(8-(2-Chloro-3,4,5-trimethoxy-phenylsulfanyl)-9-pen...)
Show SMILES COc1cc(Sc2nc3c(N)ncnc3n2CCCC#C)c(Cl)c(OC)c1OC
Show InChI InChI=1S/C19H20ClN5O3S/c1-5-6-7-8-25-18-14(17(21)22-10-23-18)24-19(25)29-12-9-11(26-2)15(27-3)16(28-4)13(12)20/h1,9-10H,6-8H2,2-4H3,(H2,21,22,23)
NCI pathway
Reactome pathway
n/an/an/an/a 4.24E+4n/an/an/an/a
Memorial Sloan-Kettering Cancer Center
Curated by ChEMBL
Assay Description
Effective concentration of compound against heat shock protein HSP90 determined in normal brain cells
J Med Chem 48: 2892-905 (2005)
Article DOI: 10.1021/jm049012b
BindingDB Entry DOI: 10.7270/Q2N29WF6
Heat Shock Protein 90 (Hsp90)
(Homo sapiens (Human))
BDBM50165293
(8-(2-Chloro-3,4,5-trimethoxy-phenylsulfanyl)-9-pen...)
Show SMILES COc1cc(Sc2nc3c(N)ncnc3n2CCCC#C)c(Cl)c(OC)c1OC
Show InChI InChI=1S/C19H20ClN5O3S/c1-5-6-7-8-25-18-14(17(21)22-10-23-18)24-19(25)29-12-9-11(26-2)15(27-3)16(28-4)13(12)20/h1,9-10H,6-8H2,2-4H3,(H2,21,22,23)
Reactome pathway
n/an/a 9.10E+3n/an/an/an/an/an/a
Memorial Sloan-Kettering Cancer Center
Curated by ChEMBL
Assay Description
Inhibition of Hsp90 protein as degradation of HER2 kinase in SKBr3 cells
J Med Chem 48: 2892-905 (2005)
Article DOI: 10.1021/jm049012b
BindingDB Entry DOI: 10.7270/Q2N29WF6