BDBM50165375 CHEMBL3797412
SMILES: CCN(C)Cc1sc(cc1C)-c1nc(no1)-c1cc(C)c(OC[C@@H](O)CNC(=O)CO)c(CC)c1
InChI Key: InChIKey=SQCHEXZMUPJZER-IBGZPJMESA-N
Data: 2 EC50
Activity Spreadsheet -- Enzyme Inhibition Constant Data from BindingDB
Found 2 hits for monomerid = 50165375
Trg + Lig
Ki
nM
ΔG°
kcal/mole
IC50
nM
Kd
nM
EC50/IC50
nM
koff
s-1
kon
M-1s-1
pHTemp
°C
Sphingosine 1-phosphate receptor 3
(Homo sapiens (Human))
BDBM50165375
(CHEMBL3797412)
Show SMILES CCN(C)Cc1sc(cc1C)-c1nc(no1)-c1cc(C)c(OC[C@@H](O)CNC(=O)CO)c(CC)c1 |r|
Show InChI InChI=1S/C25H34N4O5S/c1-6-17-10-18(8-16(4)23(17)33-14-19(31)11-26-22(32)13-30)24-27-25(34-28-24)20-9-15(3)21(35-20)12-29(5)7-2/h8-10,19,30-31H,6-7,11-14H2,1-5H3,(H,26,32)/t19-/m0/s1
NCI pathway
Reactome pathway
n/an/an/an/a 150n/an/an/an/a
Actelion Pharmaceuticals Ltd.
Curated by ChEMBL
Assay Description
Agonist activity at human recombinant S1PR3 expressed in CHO cell membranes assessed as [35S]GTPgammaS binding preincubated for 30 mins followed by [...
Eur J Med Chem 116: 222-238 (2016)
BindingDB Entry DOI: 10.7270/Q2ST7RRN
Sphingosine 1-phosphate receptor 1
(Homo sapiens (Human))
BDBM50165375
(CHEMBL3797412)
Show SMILES CCN(C)Cc1sc(cc1C)-c1nc(no1)-c1cc(C)c(OC[C@@H](O)CNC(=O)CO)c(CC)c1 |r|
Show InChI InChI=1S/C25H34N4O5S/c1-6-17-10-18(8-16(4)23(17)33-14-19(31)11-26-22(32)13-30)24-27-25(34-28-24)20-9-15(3)21(35-20)12-29(5)7-2/h8-10,19,30-31H,6-7,11-14H2,1-5H3,(H,26,32)/t19-/m0/s1
Reactome pathway
n/an/an/an/a 1.30n/an/an/an/a
Actelion Pharmaceuticals Ltd.
Curated by ChEMBL
Assay Description
Agonist activity at human recombinant S1PR1 expressed in CHO cell membranes assessed as [35S]GTPgammaS binding preincubated for 30 mins followed by [...
Eur J Med Chem 116: 222-238 (2016)
BindingDB Entry DOI: 10.7270/Q2ST7RRN