null
SMILES: CCN(CC)Cc1ccc(cc1CC)-c1nc(no1)-c1cc(C)c(OC[C@@H](O)CNC(=O)CO)c(CC)c1
InChI Key: InChIKey=HHQUGBXEPAXXNM-VWLOTQADSA-N
Activity Spreadsheet -- Enzyme Inhibition Constant Data from BindingDB
Found 2 hits for monomerid = 50165378
Trg + Lig
Ki
nM
ΔG°
kcal/mole
IC50
nM
Kd
nM
EC50/IC50
nM
koff
s-1
kon
M-1s-1
pHTemp
°C
Sphingosine 1-phosphate receptor 3
(Homo sapiens (Human))
BDBM50165378
(CHEMBL3797596)
Show SMILES CCN(CC)Cc1ccc(cc1CC)-c1nc(no1)-c1cc(C)c(OC[C@@H](O)CNC(=O)CO)c(CC)c1 |r|
Show InChI InChI=1S/C29H40N4O5/c1-6-20-13-22(10-11-23(20)16-33(8-3)9-4)29-31-28(32-38-29)24-12-19(5)27(21(7-2)14-24)37-18-25(35)15-30-26(36)17-34/h10-14,25,34-35H,6-9,15-18H2,1-5H3,(H,30,36)/t25-/m0/s1
NCI pathway
Reactome pathway
n/an/an/an/a 210n/an/an/an/a
Actelion Pharmaceuticals Ltd.
Curated by ChEMBL
Assay Description
Agonist activity at human recombinant S1PR3 expressed in CHO cell membranes assessed as [35S]GTPgammaS binding preincubated for 30 mins followed by [...
Eur J Med Chem 116: 222-238 (2016)
BindingDB Entry DOI: 10.7270/Q2ST7RRN
Sphingosine 1-phosphate receptor 1
(Homo sapiens (Human))
BDBM50165378
(CHEMBL3797596)
Show SMILES CCN(CC)Cc1ccc(cc1CC)-c1nc(no1)-c1cc(C)c(OC[C@@H](O)CNC(=O)CO)c(CC)c1 |r|
Show InChI InChI=1S/C29H40N4O5/c1-6-20-13-22(10-11-23(20)16-33(8-3)9-4)29-31-28(32-38-29)24-12-19(5)27(21(7-2)14-24)37-18-25(35)15-30-26(36)17-34/h10-14,25,34-35H,6-9,15-18H2,1-5H3,(H,30,36)/t25-/m0/s1
Reactome pathway
n/an/an/an/a 1n/an/an/an/a
Actelion Pharmaceuticals Ltd.
Curated by ChEMBL
Assay Description
Agonist activity at human recombinant S1PR1 expressed in CHO cell membranes assessed as [35S]GTPgammaS binding preincubated for 30 mins followed by [...
Eur J Med Chem 116: 222-238 (2016)
BindingDB Entry DOI: 10.7270/Q2ST7RRN