BDBM50165425 CHEMBL195963::[(S)-1-((R)-1-Phenyl-ethylaminooxalyl)-pentyl]-carbamic acid (S)-(1,2,3,4-tetrahydro-naphthalen-1-yl) ester
SMILES: CCCC[C@H](NC(=O)O[C@H]1CCCc2ccccc12)C(=O)C(=O)N[C@H](C)c1ccccc1
InChI Key: InChIKey=SDWKGFZATWAOLK-LEOXJPRUSA-N
Data: 6 IC50
Activity Spreadsheet -- Enzyme Inhibition Constant Data from BindingDB
Found 6 hits for monomerid = 50165425
Trg + Lig
Ki
nM
ΔG°
kcal/mole
IC50
nM
Kd
nM
EC50/IC50
nM
koff
s-1
kon
M-1s-1
pHTemp
°C
Pro-cathepsin H
(Homo sapiens (Human))
BDBM50165425
(CHEMBL195963 | [(S)-1-((R)-1-Phenyl-ethylaminooxal...)
Show SMILES CCCC[C@H](NC(=O)O[C@H]1CCCc2ccccc12)C(=O)C(=O)N[C@H](C)c1ccccc1
Show InChI InChI=1S/C26H32N2O4/c1-3-4-16-22(24(29)25(30)27-18(2)19-11-6-5-7-12-19)28-26(31)32-23-17-10-14-20-13-8-9-15-21(20)23/h5-9,11-13,15,18,22-23H,3-4,10,14,16-17H2,1-2H3,(H,27,30)(H,28,31)/t18-,22+,23+/m1/s1
n/an/a>2.00E+3n/an/an/an/an/an/a
GlaxoSmithKline
Curated by ChEMBL
Assay Description
Inhibitory concentration against human cathepsin H by fluorescence assay using 50 uM L-Arg-b-naphthalamide
Bioorg Med Chem Lett 15: 2209-13 (2005)
Article DOI: 10.1016/j.bmcl.2005.03.023
BindingDB Entry DOI: 10.7270/Q20C4V8V
Cathepsin K
(Homo sapiens (Human))
BDBM50165425
(CHEMBL195963 | [(S)-1-((R)-1-Phenyl-ethylaminooxal...)
Show SMILES CCCC[C@H](NC(=O)O[C@H]1CCCc2ccccc12)C(=O)C(=O)N[C@H](C)c1ccccc1
Show InChI InChI=1S/C26H32N2O4/c1-3-4-16-22(24(29)25(30)27-18(2)19-11-6-5-7-12-19)28-26(31)32-23-17-10-14-20-13-8-9-15-21(20)23/h5-9,11-13,15,18,22-23H,3-4,10,14,16-17H2,1-2H3,(H,27,30)(H,28,31)/t18-,22+,23+/m1/s1
Reactome pathway
n/an/a 32n/an/an/an/an/an/a
GlaxoSmithKline
Curated by ChEMBL
Assay Description
Inhibitory concentration against human cathepsin K
Bioorg Med Chem Lett 15: 2209-13 (2005)
Article DOI: 10.1016/j.bmcl.2005.03.023
BindingDB Entry DOI: 10.7270/Q20C4V8V
Procathepsin L
(Homo sapiens (Human))
BDBM50165425
(CHEMBL195963 | [(S)-1-((R)-1-Phenyl-ethylaminooxal...)
Show SMILES CCCC[C@H](NC(=O)O[C@H]1CCCc2ccccc12)C(=O)C(=O)N[C@H](C)c1ccccc1
Show InChI InChI=1S/C26H32N2O4/c1-3-4-16-22(24(29)25(30)27-18(2)19-11-6-5-7-12-19)28-26(31)32-23-17-10-14-20-13-8-9-15-21(20)23/h5-9,11-13,15,18,22-23H,3-4,10,14,16-17H2,1-2H3,(H,27,30)(H,28,31)/t18-,22+,23+/m1/s1
Reactome pathway
n/an/a 660n/an/an/an/an/an/a
GlaxoSmithKline
Curated by ChEMBL
Assay Description
Inhibitory concentration against human cathepsin L by fluorescence assay using 5 uM Cbz-Phe-Arg-AMC
Bioorg Med Chem Lett 15: 2209-13 (2005)
Article DOI: 10.1016/j.bmcl.2005.03.023
BindingDB Entry DOI: 10.7270/Q20C4V8V
Cathepsin S
(Homo sapiens (Human))
BDBM50165425
(CHEMBL195963 | [(S)-1-((R)-1-Phenyl-ethylaminooxal...)
Show SMILES CCCC[C@H](NC(=O)O[C@H]1CCCc2ccccc12)C(=O)C(=O)N[C@H](C)c1ccccc1
Show InChI InChI=1S/C26H32N2O4/c1-3-4-16-22(24(29)25(30)27-18(2)19-11-6-5-7-12-19)28-26(31)32-23-17-10-14-20-13-8-9-15-21(20)23/h5-9,11-13,15,18,22-23H,3-4,10,14,16-17H2,1-2H3,(H,27,30)(H,28,31)/t18-,22+,23+/m1/s1
Reactome pathway
n/an/a 79n/an/an/an/an/an/a
GlaxoSmithKline
Curated by ChEMBL
Assay Description
Inhibitory concentration against human cathepsin S by fluorescence assay using 10 uM Cbz-Val-Val-Arg-AMC
Bioorg Med Chem Lett 15: 2209-13 (2005)
Article DOI: 10.1016/j.bmcl.2005.03.023
BindingDB Entry DOI: 10.7270/Q20C4V8V
Cathepsin B
(Homo sapiens (Human))
BDBM50165425
(CHEMBL195963 | [(S)-1-((R)-1-Phenyl-ethylaminooxal...)
Show SMILES CCCC[C@H](NC(=O)O[C@H]1CCCc2ccccc12)C(=O)C(=O)N[C@H](C)c1ccccc1
Show InChI InChI=1S/C26H32N2O4/c1-3-4-16-22(24(29)25(30)27-18(2)19-11-6-5-7-12-19)28-26(31)32-23-17-10-14-20-13-8-9-15-21(20)23/h5-9,11-13,15,18,22-23H,3-4,10,14,16-17H2,1-2H3,(H,27,30)(H,28,31)/t18-,22+,23+/m1/s1
Reactome pathway
n/an/a>2.00E+3n/an/an/an/an/an/a
GlaxoSmithKline
Curated by ChEMBL
Assay Description
Inhibitory concentration against human cathepsin B by fluorescence assay using 10 uM Cbz-Phe-Arg-AMC
Bioorg Med Chem Lett 15: 2209-13 (2005)
Article DOI: 10.1016/j.bmcl.2005.03.023
BindingDB Entry DOI: 10.7270/Q20C4V8V
Cathepsin L2
(Homo sapiens (Human))
BDBM50165425
(CHEMBL195963 | [(S)-1-((R)-1-Phenyl-ethylaminooxal...)
Show SMILES CCCC[C@H](NC(=O)O[C@H]1CCCc2ccccc12)C(=O)C(=O)N[C@H](C)c1ccccc1
Show InChI InChI=1S/C26H32N2O4/c1-3-4-16-22(24(29)25(30)27-18(2)19-11-6-5-7-12-19)28-26(31)32-23-17-10-14-20-13-8-9-15-21(20)23/h5-9,11-13,15,18,22-23H,3-4,10,14,16-17H2,1-2H3,(H,27,30)(H,28,31)/t18-,22+,23+/m1/s1
n/an/a 340n/an/an/an/an/an/a
GlaxoSmithKline
Curated by ChEMBL
Assay Description
Inhibitory concentration against human cathepsin V by fluorescence assay using 2 uM Cbz-Phe-Arg-AMC
Bioorg Med Chem Lett 15: 2209-13 (2005)
Article DOI: 10.1016/j.bmcl.2005.03.023
BindingDB Entry DOI: 10.7270/Q20C4V8V