BDBM50165473 CHEMBL193512::N-[3-(4-Oxo-3,4-dihydro-phthalazin-1-ylmethyl)-phenyl]-isobutyramide
SMILES: CC(C)C(=O)Nc1cccc(Cc2n[nH]c(=O)c3ccccc23)c1
InChI Key: InChIKey=KFFKUYNFVPMIMS-UHFFFAOYSA-N
Data: 1 IC50
Activity Spreadsheet -- Enzyme Inhibition Constant Data from BindingDB
Found 1 hit for monomerid = 50165473
Trg + Lig
Ki
nM
ΔG°
kcal/mole
IC50
nM
Kd
nM
EC50/IC50
nM
koff
s-1
kon
M-1s-1
pHTemp
°C
Poly [ADP-ribose] polymerase 1
(Homo sapiens (Human))
BDBM50165473
(CHEMBL193512 | N-[3-(4-Oxo-3,4-dihydro-phthalazin-...)
Show SMILES CC(C)C(=O)Nc1cccc(Cc2n[nH]c(=O)c3ccccc23)c1
Show InChI InChI=1S/C19H19N3O2/c1-12(2)18(23)20-14-7-5-6-13(10-14)11-17-15-8-3-4-9-16(15)19(24)22-21-17/h3-10,12H,11H2,1-2H3,(H,20,23)(H,22,24)
n/an/a 370n/an/an/an/an/an/a
KuDOS Horsham Ltd
Curated by ChEMBL
Assay Description
Inhibitory concentration against human poly (ADP-ribose) polymerase 1 (PARP-1)
Bioorg Med Chem Lett 15: 2235-8 (2005)
Article DOI: 10.1016/j.bmcl.2005.03.026
BindingDB Entry DOI: 10.7270/Q2QV3M0B