BDBM50165498 1-(2-fluoro-5-((4-oxo-3,4-dihydrophthalazin-1-yl)methyl)phenyl)-3-phenylpyrrolidine-2,5-dione::1-[2-Fluoro-5-(4-oxo-3,4-dihydro-phthalazin-1-ylmethyl)-phenyl]-3-phenyl-pyrrolidine-2,5-dione::CHEMBL196450
SMILES: Oc1cc(c(O)n1-c1cc(Cc2n[nH]c(=O)c3ccccc23)ccc1F)-c1ccccc1
InChI Key: InChIKey=SXGNMFNPTJQOIT-UHFFFAOYSA-N
Data: 2 IC50
Activity Spreadsheet -- Enzyme Inhibition Constant Data from BindingDB
Found 2 hits for monomerid = 50165498
Trg + Lig
Ki
nM
ΔG°
kcal/mole
IC50
nM
Kd
nM
EC50/IC50
nM
koff
s-1
kon
M-1s-1
pHTemp
°C
Poly [ADP-ribose] polymerase 1
(Homo sapiens (Human))
BDBM50165498
(1-(2-fluoro-5-((4-oxo-3,4-dihydrophthalazin-1-yl)m...)
Show SMILES Oc1cc(c(O)n1-c1cc(Cc2n[nH]c(=O)c3ccccc23)ccc1F)-c1ccccc1 |(14.66,-43.53,;15.81,-44.55,;17.31,-44.22,;18.09,-45.55,;17.07,-46.7,;17.4,-48.2,;15.67,-46.09,;14.34,-46.87,;13,-46.11,;11.68,-46.89,;10.34,-46.12,;10.34,-44.58,;11.68,-43.8,;11.67,-42.26,;10.32,-41.48,;10.31,-39.94,;8.99,-42.27,;7.65,-41.51,;6.33,-42.28,;6.33,-43.82,;7.66,-44.59,;9,-43.82,;11.68,-48.42,;13.01,-49.19,;14.35,-48.41,;15.68,-49.18,;19.63,-45.56,;20.38,-46.9,;21.92,-46.92,;22.71,-45.59,;21.94,-44.24,;20.41,-44.23,)|
Show InChI InChI=1S/C25H18FN3O3/c26-20-11-10-15(12-21-17-8-4-5-9-18(17)24(31)28-27-21)13-22(20)29-23(30)14-19(25(29)32)16-6-2-1-3-7-16/h1-11,13-14,30,32H,12H2,(H,28,31)
n/an/a 6.80n/an/an/an/an/an/a
Huazhong University of Science and Technology
Curated by ChEMBL
Assay Description
Inhibition of human recombinant PARP1
J Med Chem 52: 718-25 (2009)
Article DOI: 10.1021/jm800902t
BindingDB Entry DOI: 10.7270/Q2C53KPW
Poly [ADP-ribose] polymerase 1
(Homo sapiens (Human))
BDBM50165498
(1-(2-fluoro-5-((4-oxo-3,4-dihydrophthalazin-1-yl)m...)
Show SMILES Oc1cc(c(O)n1-c1cc(Cc2n[nH]c(=O)c3ccccc23)ccc1F)-c1ccccc1 |(14.66,-43.53,;15.81,-44.55,;17.31,-44.22,;18.09,-45.55,;17.07,-46.7,;17.4,-48.2,;15.67,-46.09,;14.34,-46.87,;13,-46.11,;11.68,-46.89,;10.34,-46.12,;10.34,-44.58,;11.68,-43.8,;11.67,-42.26,;10.32,-41.48,;10.31,-39.94,;8.99,-42.27,;7.65,-41.51,;6.33,-42.28,;6.33,-43.82,;7.66,-44.59,;9,-43.82,;11.68,-48.42,;13.01,-49.19,;14.35,-48.41,;15.68,-49.18,;19.63,-45.56,;20.38,-46.9,;21.92,-46.92,;22.71,-45.59,;21.94,-44.24,;20.41,-44.23,)|
Show InChI InChI=1S/C25H18FN3O3/c26-20-11-10-15(12-21-17-8-4-5-9-18(17)24(31)28-27-21)13-22(20)29-23(30)14-19(25(29)32)16-6-2-1-3-7-16/h1-11,13-14,30,32H,12H2,(H,28,31)
n/an/a 6.80n/an/an/an/an/an/a
KuDOS Horsham Ltd
Curated by ChEMBL
Assay Description
Inhibitory concentration against human poly (ADP-ribose) polymerase 1 (PARP-1)
Bioorg Med Chem Lett 15: 2235-8 (2005)
Article DOI: 10.1016/j.bmcl.2005.03.026
BindingDB Entry DOI: 10.7270/Q2QV3M0B