null
SMILES: COc1cc2c(Nc3c(F)ccc(O)c3C)ncnc2cc1OCCCN1CCN(C)CC1
InChI Key: InChIKey=PZSVADNOJUBASZ-UHFFFAOYSA-N
Activity Spreadsheet -- Enzyme Inhibition Constant Data from BindingDB
Found 3 hits for monomerid = 50165972
Trg + Lig
Ki
nM
ΔG°
kcal/mole
IC50
nM
Kd
nM
EC50/IC50
nM
koff
s-1
kon
M-1s-1
pHTemp
°C
Vascular endothelial growth factor receptor 2
(Homo sapiens (Human))
BDBM50165972
(CHEMBL3800348)
Show SMILES COc1cc2c(Nc3c(F)ccc(O)c3C)ncnc2cc1OCCCN1CCN(C)CC1
Show InChI InChI=1S/C24H30FN5O3/c1-16-20(31)6-5-18(25)23(16)28-24-17-13-21(32-3)22(14-19(17)26-15-27-24)33-12-4-7-30-10-8-29(2)9-11-30/h5-6,13-15,31H,4,7-12H2,1-3H3,(H,26,27,28)
NCI pathway
Reactome pathway
n/an/a>1.00E+4n/an/an/an/an/an/a
University of Manchester
Curated by ChEMBL
Assay Description
Inhibition of recombinant KDR (unknown origin) expressed in IL3 deficient BAF3 cells assessed as reduction in cell viability after 48 hrs by CellTite...
Bioorg Med Chem Lett 26: 2724-9 (2016)
Article DOI: 10.1016/j.bmcl.2016.03.100
BindingDB Entry DOI: 10.7270/Q2WM1G93
Kinesin-1 heavy chain/Proto-oncogene tyrosine-protein kinase receptor Ret
(Homo sapiens (Human))
BDBM50165972
(CHEMBL3800348)
Show SMILES COc1cc2c(Nc3c(F)ccc(O)c3C)ncnc2cc1OCCCN1CCN(C)CC1
Show InChI InChI=1S/C24H30FN5O3/c1-16-20(31)6-5-18(25)23(16)28-24-17-13-21(32-3)22(14-19(17)26-15-27-24)33-12-4-7-30-10-8-29(2)9-11-30/h5-6,13-15,31H,4,7-12H2,1-3H3,(H,26,27,28)
n/an/a 4.60E+3n/an/an/an/an/an/a
University of Manchester
Curated by ChEMBL
Assay Description
Inhibition of recombinant KIF5B/RET (unknown origin) expressed in IL3 deficient BAF3 cells assessed as reduction in cell viability after 48 hrs by Ce...
Bioorg Med Chem Lett 26: 2724-9 (2016)
Article DOI: 10.1016/j.bmcl.2016.03.100
BindingDB Entry DOI: 10.7270/Q2WM1G93
Proto-oncogene tyrosine-protein kinase receptor Ret
(Homo sapiens (Human))
BDBM50165972
(CHEMBL3800348)
Show SMILES COc1cc2c(Nc3c(F)ccc(O)c3C)ncnc2cc1OCCCN1CCN(C)CC1
Show InChI InChI=1S/C24H30FN5O3/c1-16-20(31)6-5-18(25)23(16)28-24-17-13-21(32-3)22(14-19(17)26-15-27-24)33-12-4-7-30-10-8-29(2)9-11-30/h5-6,13-15,31H,4,7-12H2,1-3H3,(H,26,27,28)
n/an/a 29n/an/an/an/an/an/a
University of Manchester
Curated by ChEMBL
Assay Description
Inhibition of N-terminal GST fused human RET (658 to 1114 amino acid residue) using CSKtide as substrate expressed in baculovirus preincubated for 15...
Bioorg Med Chem Lett 26: 2724-9 (2016)
Article DOI: 10.1016/j.bmcl.2016.03.100
BindingDB Entry DOI: 10.7270/Q2WM1G93