BDBM50166096 CHEMBL372874::N-[(2S,5R,11S,14S,16aS)-14-(3-Guanidino-propyl)-5-(4-hydroxy-benzyl)-11-naphthalen-2-ylmethyl-4,7,10,13,16-pentaoxo-hexadecahydro-3a,6,9,12,15-pentaaza-cyclopentacyclopentadecen-2-yl]-guanidine
SMILES: [#7]-[#6](=[#7])-[#7]-[#6]-[#6]-[#6]-[#6@@H]-1-[#7]-[#6](=O)-[#6@@H]-2-[#6]-[#6@@H](-[#6]-[#7]-2-[#6](=O)-[#6@@H](-[#6]-c2ccc(-[#8])cc2)-[#7]-[#6](=O)-[#6]-[#7]-[#6](=O)-[#6@H](-[#6]-c2ccc3ccccc3c2)-[#7]-[#6]-1=O)\[#7]=[#6](/[#7])-[#7]
InChI Key: InChIKey=LJEYFXLNHZFXCI-WJCXGNHWSA-N
Data: 1 IC50
Activity Spreadsheet -- Enzyme Inhibition Constant Data from BindingDB
Found 1 hit for monomerid = 50166096
Trg + Lig
Ki
nM
ΔG°
kcal/mole
IC50
nM
Kd
nM
EC50/IC50
nM
koff
s-1
kon
M-1s-1
pHTemp
°C
C-X-C chemokine receptor type 4 (CXCR4)
(Homo sapiens (Human))
BDBM50166096
(CHEMBL372874 | N-[(2S,5R,11S,14S,16aS)-14-(3-Guani...)
Show SMILES [#7]-[#6](=[#7])-[#7]-[#6]-[#6]-[#6]-[#6@@H]-1-[#7]-[#6](=O)-[#6@@H]-2-[#6]-[#6@@H](-[#6]-[#7]-2-[#6](=O)-[#6@@H](-[#6]-c2ccc(-[#8])cc2)-[#7]-[#6](=O)-[#6]-[#7]-[#6](=O)-[#6@H](-[#6]-c2ccc3ccccc3c2)-[#7]-[#6]-1=O)\[#7]=[#6](/[#7])-[#7]
Show InChI InChI=1S/C36H45N11O6/c37-35(38)41-13-3-6-26-32(51)46-27(16-21-7-10-22-4-1-2-5-23(22)14-21)31(50)42-18-30(49)44-28(15-20-8-11-25(48)12-9-20)34(53)47-19-24(43-36(39)40)17-29(47)33(52)45-26/h1-2,4-5,7-12,14,24,26-29,48H,3,6,13,15-19H2,(H,42,50)(H,44,49)(H,45,52)(H,46,51)(H4,37,38,41)(H4,39,40,43)/t24-,26-,27-,28+,29-/m0/s1
n/an/a 9.90n/an/an/an/an/an/a
Kyoto University
Curated by ChEMBL
Assay Description
Inhibition of [125I]-SDF-1 binding to C-X-C chemokine receptor type 4 (CXCR4) expressed in CHO cells
J Med Chem 48: 3280-9 (2005)
Article DOI: 10.1021/jm050009h
BindingDB Entry DOI: 10.7270/Q24X5790