BDBM50166276 CHEMBL363398::[5-(4-Methanesulfonyl-phenyl)-2-methyl-1-p-tolyl-1H-pyrrol-3-yl]-acetic acid ethyl ester::ethyl 2-(2-methyl-5-(4-(methylsulfonyl)phenyl)-1-p-tolyl-1H-pyrrol-3-yl)acetate
SMILES: CCOC(=O)Cc1cc(-c2ccc(cc2)S(C)(=O)=O)n(c1C)-c1ccc(C)cc1
InChI Key: InChIKey=WNBVYZJUSZQNIF-UHFFFAOYSA-N
Data: 4 IC50
Activity Spreadsheet -- Enzyme Inhibition Constant Data from BindingDB
Found 4 hits for monomerid = 50166276
Trg + Lig
Ki
nM
ΔG°
kcal/mole
IC50
nM
Kd
nM
EC50/IC50
nM
koff
s-1
kon
M-1s-1
pHTemp
°C
Cyclooxygenase-2 (COX-2)
(Mus musculus (Mouse))
BDBM50166276
(CHEMBL363398 | [5-(4-Methanesulfonyl-phenyl)-2-met...)
Show SMILES CCOC(=O)Cc1cc(-c2ccc(cc2)S(C)(=O)=O)n(c1C)-c1ccc(C)cc1
Show InChI InChI=1S/C23H25NO4S/c1-5-28-23(25)15-19-14-22(18-8-12-21(13-9-18)29(4,26)27)24(17(19)3)20-10-6-16(2)7-11-20/h6-14H,5,15H2,1-4H3
n/an/a 480n/an/an/an/an/an/a
Università "La Sapienza"
Curated by ChEMBL
Assay Description
In vitro inhibitory activity against Prostaglandin G/H synthase 2 in murine J774 cells
J Med Chem 48: 3428-32 (2005)
Article DOI: 10.1021/jm049121q
BindingDB Entry DOI: 10.7270/Q2N01628
Prostaglandin G/H synthase (cyclooxygenase)
(Mus musculus)
BDBM50166276
(CHEMBL363398 | [5-(4-Methanesulfonyl-phenyl)-2-met...)
Show SMILES CCOC(=O)Cc1cc(-c2ccc(cc2)S(C)(=O)=O)n(c1C)-c1ccc(C)cc1
Show InChI InChI=1S/C23H25NO4S/c1-5-28-23(25)15-19-14-22(18-8-12-21(13-9-18)29(4,26)27)24(17(19)3)20-10-6-16(2)7-11-20/h6-14H,5,15H2,1-4H3
Reactome pathway
n/an/a>1.00E+5n/an/an/an/an/an/a
Universita di Siena
Curated by ChEMBL
Assay Description
Inhibition of mouse COX1 in mouse J774 cells assessed as PGE2 production by radioimmunoassay
J Med Chem 51: 4476-81 (2008)
Article DOI: 10.1021/jm800084s
BindingDB Entry DOI: 10.7270/Q2KH0N55
Cyclooxygenase-2 (COX-2)
(Mus musculus (Mouse))
BDBM50166276
(CHEMBL363398 | [5-(4-Methanesulfonyl-phenyl)-2-met...)
Show SMILES CCOC(=O)Cc1cc(-c2ccc(cc2)S(C)(=O)=O)n(c1C)-c1ccc(C)cc1
Show InChI InChI=1S/C23H25NO4S/c1-5-28-23(25)15-19-14-22(18-8-12-21(13-9-18)29(4,26)27)24(17(19)3)20-10-6-16(2)7-11-20/h6-14H,5,15H2,1-4H3
n/an/a 480n/an/an/an/an/an/a
Universita di Siena
Curated by ChEMBL
Assay Description
Inhibition of mouse COX2 in LPS-stimulated mouse J774 cells assessed as PGE2 production by radioimmunoassay
J Med Chem 51: 4476-81 (2008)
Article DOI: 10.1021/jm800084s
BindingDB Entry DOI: 10.7270/Q2KH0N55
Prostaglandin G/H synthase (cyclooxygenase)
(Mus musculus)
BDBM50166276
(CHEMBL363398 | [5-(4-Methanesulfonyl-phenyl)-2-met...)
Show SMILES CCOC(=O)Cc1cc(-c2ccc(cc2)S(C)(=O)=O)n(c1C)-c1ccc(C)cc1
Show InChI InChI=1S/C23H25NO4S/c1-5-28-23(25)15-19-14-22(18-8-12-21(13-9-18)29(4,26)27)24(17(19)3)20-10-6-16(2)7-11-20/h6-14H,5,15H2,1-4H3
Reactome pathway
n/an/a>1.00E+5n/an/an/an/an/an/a
Università "La Sapienza"
Curated by ChEMBL
Assay Description
In vitro inhibitory activity against Prostaglandin G/H synthase 1 in murine J774 cells
J Med Chem 48: 3428-32 (2005)
Article DOI: 10.1021/jm049121q
BindingDB Entry DOI: 10.7270/Q2N01628