BDBM50166331 CHEMBL3798109
SMILES:
InChI Key: InChIKey=UEMWDQVZICMXHX-UHFFFAOYSA-N
Data: 2 IC50
Activity Spreadsheet -- Enzyme Inhibition Constant Data from BindingDB
Found 2 hits for monomerid = 50166331
Trg + Lig
Ki
nM
ΔG°
kcal/mole
IC50
nM
Kd
nM
EC50/IC50
nM
koff
s-1
kon
M-1s-1
pHTemp
°C
Mitogen-activated protein kinase 1
(Homo sapiens (Human))
BDBM50166331
(CHEMBL3798109)
Show InChI InChI=1S/C20H16N4O/c25-20(22-13-14-4-2-1-3-5-14)16-6-7-18-17(12-16)19(24-23-18)15-8-10-21-11-9-15/h1-12H,13H2,(H,22,25)(H,23,24)
NCI pathway
Reactome pathway
n/an/a 51n/an/an/an/an/an/a
Green Valley Research Institute
Curated by ChEMBL
Assay Description
Inhibition of human recombinant GST-tagged ERK2 expressed in Escherichia coli using ser/thr 3 Peptide as substrate preincubated for 1 hr measured aft...
Bioorg Med Chem Lett 26: 2600-4 (2016)
Article DOI: 10.1016/j.bmcl.2016.04.029
BindingDB Entry DOI: 10.7270/Q2H99731
Mitogen-activated protein kinase 3
(Homo sapiens (Human))
BDBM50166331
(CHEMBL3798109)
Show InChI InChI=1S/C20H16N4O/c25-20(22-13-14-4-2-1-3-5-14)16-6-7-18-17(12-16)19(24-23-18)15-8-10-21-11-9-15/h1-12H,13H2,(H,22,25)(H,23,24)
Reactome pathway
n/an/a 106n/an/an/an/an/an/a
Green Valley Research Institute
Curated by ChEMBL
Assay Description
Inhibition of human recombinant GST-tagged ERK1 expressed in Escherichia coli using ser/thr 3 Peptide as substrate preincubated for 1 hr measured aft...
Bioorg Med Chem Lett 26: 2600-4 (2016)
Article DOI: 10.1016/j.bmcl.2016.04.029
BindingDB Entry DOI: 10.7270/Q2H99731