BDBM50166374 (Z)-2-Benzoylamino-3-[4-(2-chloro-6-fluoro-phenoxy)-phenyl]-acrylic acid::CHEMBL193427
SMILES: OC(=O)C(\NC(=O)c1ccccc1)=C\c1ccc(Oc2c(F)cccc2Cl)cc1
InChI Key: InChIKey=MYJSJBNPBREAIS-UYRXBGFRSA-N
Data: 1 IC50
Activity Spreadsheet -- Enzyme Inhibition Constant Data from BindingDB
Found 1 hit for monomerid = 50166374
Trg + Lig
Ki
nM
ΔG°
kcal/mole
IC50
nM
Kd
nM
EC50/IC50
nM
koff
s-1
kon
M-1s-1
pHTemp
°C
Hepatitis C virus NS5B RNA-dependent RNA polymerase
(Hepatitis C virus)
BDBM50166374
((Z)-2-Benzoylamino-3-[4-(2-chloro-6-fluoro-phenoxy...)
Show SMILES OC(=O)C(\NC(=O)c1ccccc1)=C\c1ccc(Oc2c(F)cccc2Cl)cc1
Show InChI InChI=1S/C22H15ClFNO4/c23-17-7-4-8-18(24)20(17)29-16-11-9-14(10-12-16)13-19(22(27)28)25-21(26)15-5-2-1-3-6-15/h1-13H,(H,25,26)(H,27,28)/b19-13-
n/an/a 70n/an/an/an/an/an/a
Pfizer Global Research and Development
Curated by ChEMBL
Assay Description
Inhibitory concentration against Hepatitis C virus NS5B polymerase
Bioorg Med Chem Lett 15: 2481-6 (2005)
Article DOI: 10.1016/j.bmcl.2005.03.066
BindingDB Entry DOI: 10.7270/Q2VH5NC7