BDBM50166411 CHEMBL3799113
SMILES:
InChI Key: InChIKey=XCHPMRIRNSGKEK-UHFFFAOYSA-N
Data: 2 IC50
Activity Spreadsheet -- Enzyme Inhibition Constant Data from BindingDB
Found 2 hits for monomerid = 50166411
Trg + Lig
Ki
nM
ΔG°
kcal/mole
IC50
nM
Kd
nM
EC50/IC50
nM
koff
s-1
kon
M-1s-1
pHTemp
°C
Mitogen-activated protein kinase 1
(Homo sapiens (Human))
BDBM50166411
(CHEMBL3799113)
Show InChI InChI=1S/C20H13Cl2FN4O/c21-15-3-1-13(17(22)18(15)23)10-25-20(28)12-2-4-16-14(9-12)19(27-26-16)11-5-7-24-8-6-11/h1-9H,10H2,(H,25,28)(H,26,27)
NCI pathway
Reactome pathway
n/an/a 12n/an/an/an/an/an/a
Green Valley Research Institute
Curated by ChEMBL
Assay Description
Inhibition of human recombinant GST-tagged ERK2 expressed in Escherichia coli using ser/thr 3 Peptide as substrate preincubated for 1 hr measured aft...
Bioorg Med Chem Lett 26: 2600-4 (2016)
Article DOI: 10.1016/j.bmcl.2016.04.029
BindingDB Entry DOI: 10.7270/Q2H99731
Mitogen-activated protein kinase 3
(Homo sapiens (Human))
BDBM50166411
(CHEMBL3799113)
Show InChI InChI=1S/C20H13Cl2FN4O/c21-15-3-1-13(17(22)18(15)23)10-25-20(28)12-2-4-16-14(9-12)19(27-26-16)11-5-7-24-8-6-11/h1-9H,10H2,(H,25,28)(H,26,27)
Reactome pathway
n/an/a 29n/an/an/an/an/an/a
Green Valley Research Institute
Curated by ChEMBL
Assay Description
Inhibition of human recombinant GST-tagged ERK1 expressed in Escherichia coli using ser/thr 3 Peptide as substrate preincubated for 1 hr measured aft...
Bioorg Med Chem Lett 26: 2600-4 (2016)
Article DOI: 10.1016/j.bmcl.2016.04.029
BindingDB Entry DOI: 10.7270/Q2H99731