BDBM50166417 CHEMBL3799370
SMILES: CC(CNC(=O)c1ccc2[nH]nc(-c3ccncc3)c2c1)OCc1ccccc1
InChI Key:
Data: 1 IC50
Activity Spreadsheet -- Enzyme Inhibition Constant Data from BindingDB
Found 1 hit for monomerid = 50166417
Trg + Lig
Ki
nM
ΔG°
kcal/mole
IC50
nM
Kd
nM
EC50/IC50
nM
koff
s-1
kon
M-1s-1
pHTemp
°C
Mitogen-activated protein kinase 1
(Homo sapiens (Human))
BDBM50166417
(CHEMBL3799370)
Show SMILES CC(CNC(=O)c1ccc2[nH]nc(-c3ccncc3)c2c1)OCc1ccccc1
NCI pathway
Reactome pathway
n/an/a 89n/an/an/an/an/an/a
Green Valley Research Institute
Curated by ChEMBL
Assay Description
Inhibition of human recombinant GST-tagged ERK2 expressed in Escherichia coli using ser/thr 3 Peptide as substrate preincubated for 1 hr measured aft...
Bioorg Med Chem Lett 26: 2600-4 (2016)
Article DOI: 10.1016/j.bmcl.2016.04.029
BindingDB Entry DOI: 10.7270/Q2H99731