BDBM50166480 1,2-Bis-(4-chloro-phenyl)-4-[2-(4-fluoro-phenyl)-2-oxo-ethyl]-pyrazolidine-3,5-dione::CHEMBL193276
SMILES: Oc1c(CC(=O)c2ccc(F)cc2)c(=O)n(-c2ccc(Cl)cc2)n1-c1ccc(Cl)cc1
InChI Key: InChIKey=UWBXTEUTLIEZIW-UHFFFAOYSA-N
Data: 3 IC50
Activity Spreadsheet -- Enzyme Inhibition Constant Data from BindingDB
Found 3 hits for monomerid = 50166480
Trg + Lig
Ki
nM
ΔG°
kcal/mole
IC50
nM
Kd
nM
EC50/IC50
nM
koff
s-1
kon
M-1s-1
pHTemp
°C
MurA (E. coli)
(Escherichia coli K-12 (Enterobacteria))
BDBM50166480
(1,2-Bis-(4-chloro-phenyl)-4-[2-(4-fluoro-phenyl)-2...)
Show SMILES Oc1c(CC(=O)c2ccc(F)cc2)c(=O)n(-c2ccc(Cl)cc2)n1-c1ccc(Cl)cc1
Show InChI InChI=1S/C23H15Cl2FN2O3/c24-15-3-9-18(10-4-15)27-22(30)20(13-21(29)14-1-7-17(26)8-2-14)23(31)28(27)19-11-5-16(25)6-12-19/h1-12,30H,13H2
n/an/a 8.40E+3n/an/an/an/an/an/a
Wyeth Research
Curated by ChEMBL
Assay Description
Inhibitory concentration against MurA enzyme in Escherichia coli
Bioorg Med Chem Lett 15: 2527-31 (2005)
Article DOI: 10.1016/j.bmcl.2005.03.058
BindingDB Entry DOI: 10.7270/Q2BG2NHW
MurB (S. aureus)
(Staphylococcus aureus (Firmicutes))
BDBM50166480
(1,2-Bis-(4-chloro-phenyl)-4-[2-(4-fluoro-phenyl)-2...)
Show SMILES Oc1c(CC(=O)c2ccc(F)cc2)c(=O)n(-c2ccc(Cl)cc2)n1-c1ccc(Cl)cc1
Show InChI InChI=1S/C23H15Cl2FN2O3/c24-15-3-9-18(10-4-15)27-22(30)20(13-21(29)14-1-7-17(26)8-2-14)23(31)28(27)19-11-5-16(25)6-12-19/h1-12,30H,13H2
n/an/a 5.20E+3n/an/an/an/an/an/a
Wyeth Research
Curated by ChEMBL
Assay Description
Inhibitory concentration against MurB enzyme in Staphylococcus aureus
Bioorg Med Chem Lett 15: 2527-31 (2005)
Article DOI: 10.1016/j.bmcl.2005.03.058
BindingDB Entry DOI: 10.7270/Q2BG2NHW
MurB (E. coli)
(Escherichia coli K-12 (Enterobacteria))
BDBM50166480
(1,2-Bis-(4-chloro-phenyl)-4-[2-(4-fluoro-phenyl)-2...)
Show SMILES Oc1c(CC(=O)c2ccc(F)cc2)c(=O)n(-c2ccc(Cl)cc2)n1-c1ccc(Cl)cc1
Show InChI InChI=1S/C23H15Cl2FN2O3/c24-15-3-9-18(10-4-15)27-22(30)20(13-21(29)14-1-7-17(26)8-2-14)23(31)28(27)19-11-5-16(25)6-12-19/h1-12,30H,13H2
n/an/a 5.40E+3n/an/an/an/an/an/a
Wyeth Research
Curated by ChEMBL
Assay Description
Inhibitory concentration against MurB enzyme in Escherichia coli
Bioorg Med Chem Lett 15: 2527-31 (2005)
Article DOI: 10.1016/j.bmcl.2005.03.058
BindingDB Entry DOI: 10.7270/Q2BG2NHW