BDBM50166512 3-[2-(3-Fluoro-phenyl)-ethyl]-2-(2-hydroxy-phenyl)-5,6-dimethyl-3H-pyrimidin-4-one::CHEMBL193498
SMILES: Cc1nc(-c2ccccc2O)n(CCc2cccc(F)c2)c(=O)c1C
InChI Key: InChIKey=FHWPMBMRZSDIGY-UHFFFAOYSA-N
Data: 1 IC50
Activity Spreadsheet -- Enzyme Inhibition Constant Data from BindingDB
Found 1 hit for monomerid = 50166512
Trg + Lig
Ki
nM
ΔG°
kcal/mole
IC50
nM
Kd
nM
EC50/IC50
nM
koff
s-1
kon
M-1s-1
pHTemp
°C
Calcium-sensing receptor (CaSR)
(Homo sapiens (Human))
BDBM50166512
(3-[2-(3-Fluoro-phenyl)-ethyl]-2-(2-hydroxy-phenyl)...)
Show SMILES Cc1nc(-c2ccccc2O)n(CCc2cccc(F)c2)c(=O)c1C
Show InChI InChI=1S/C20H19FN2O2/c1-13-14(2)22-19(17-8-3-4-9-18(17)24)23(20(13)25)11-10-15-6-5-7-16(21)12-15/h3-9,12,24H,10-11H2,1-2H3
n/an/a 170n/an/an/an/an/an/a
NPS Pharmaceuticals, Inc.
Curated by ChEMBL
Assay Description
Inhibitory concentration was evaluated for in vitro calcilytic activity against human calcium receptor
Bioorg Med Chem Lett 15: 2537-40 (2005)
Article DOI: 10.1016/j.bmcl.2005.03.054
BindingDB Entry DOI: 10.7270/Q26Q1WRQ