BDBM50166517 5-Cyclopropyl-3-[2-(3-fluoro-phenyl)-ethyl]-2-(2-hydroxy-phenyl)-6-methyl-3H-pyrimidin-4-one::CHEMBL195305
SMILES: Cc1nc(-c2ccccc2O)n(CCc2cccc(F)c2)c(=O)c1C1CC1
InChI Key: InChIKey=FFBYEYMJCYSSFD-UHFFFAOYSA-N
Data: 1 IC50
Activity Spreadsheet -- Enzyme Inhibition Constant Data from BindingDB
Found 1 hit for monomerid = 50166517
Trg + Lig
Ki
nM
ΔG°
kcal/mole
IC50
nM
Kd
nM
EC50/IC50
nM
koff
s-1
kon
M-1s-1
pHTemp
°C
Calcium-sensing receptor (CaSR)
(Homo sapiens (Human))
BDBM50166517
(5-Cyclopropyl-3-[2-(3-fluoro-phenyl)-ethyl]-2-(2-h...)
Show SMILES Cc1nc(-c2ccccc2O)n(CCc2cccc(F)c2)c(=O)c1C1CC1
Show InChI InChI=1S/C22H21FN2O2/c1-14-20(16-9-10-16)22(27)25(12-11-15-5-4-6-17(23)13-15)21(24-14)18-7-2-3-8-19(18)26/h2-8,13,16,26H,9-12H2,1H3
n/an/a 120n/an/an/an/an/an/a
NPS Pharmaceuticals, Inc.
Curated by ChEMBL
Assay Description
Inhibitory concentration was evaluated for in vitro calcilytic activity against human calcium receptor
Bioorg Med Chem Lett 15: 2537-40 (2005)
Article DOI: 10.1016/j.bmcl.2005.03.054
BindingDB Entry DOI: 10.7270/Q26Q1WRQ