BDBM50166691 3-Phenyl-3-{5-[2-(5,6,7,8-tetrahydro-[1,8]naphthyridin-2-yl)-ethoxy]-indol-1-yl}-propionic acid::3-phenyl-3-(5-(2-(5,6,7,8-tetrahydro-1,8-naphthyridin-2-yl)ethoxy)-1H-indol-1-yl)propanoic acid::CHEMBL372443
SMILES: OC(=O)CC(c1ccccc1)n1ccc2cc(OCCc3ccc4CCCNc4n3)ccc12
InChI Key: InChIKey=BEOOWKDNVJKISL-UHFFFAOYSA-N
Data: 3 IC50
Activity Spreadsheet -- Enzyme Inhibition Constant Data from BindingDB
Found 3 hits for monomerid = 50166691
Trg + Lig
Ki
nM
ΔG°
kcal/mole
IC50
nM
Kd
nM
EC50/IC50
nM
koff
s-1
kon
M-1s-1
pHTemp
°C
ITGAV/ITGB5
(Homo sapiens (Human))
BDBM50166691
(3-Phenyl-3-{5-[2-(5,6,7,8-tetrahydro-[1,8]naphthyr...)
Show SMILES OC(=O)CC(c1ccccc1)n1ccc2cc(OCCc3ccc4CCCNc4n3)ccc12
Show InChI InChI=1S/C27H27N3O3/c31-26(32)18-25(19-5-2-1-3-6-19)30-15-12-21-17-23(10-11-24(21)30)33-16-13-22-9-8-20-7-4-14-28-27(20)29-22/h1-3,5-6,8-12,15,17,25H,4,7,13-14,16,18H2,(H,28,29)(H,31,32)
NCI pathway
Reactome pathway
n/an/a 0.680n/an/an/an/an/an/a
Johnson& Johnson Pharmaceutical Research and Development
Curated by ChEMBL
Assay Description
Binding affinity to Integrin alpha-v-beta-5 receptor by ELISA assay
Eur J Med Chem 42: 334-43 (2007)
Article DOI: 10.1016/j.ejmech.2006.10.015
BindingDB Entry DOI: 10.7270/Q21J9BKM
ITGAV/ITGB3
(Homo sapiens (Human))
BDBM50166691
(3-Phenyl-3-{5-[2-(5,6,7,8-tetrahydro-[1,8]naphthyr...)
Show SMILES OC(=O)CC(c1ccccc1)n1ccc2cc(OCCc3ccc4CCCNc4n3)ccc12
Show InChI InChI=1S/C27H27N3O3/c31-26(32)18-25(19-5-2-1-3-6-19)30-15-12-21-17-23(10-11-24(21)30)33-16-13-22-9-8-20-7-4-14-28-27(20)29-22/h1-3,5-6,8-12,15,17,25H,4,7,13-14,16,18H2,(H,28,29)(H,31,32)
n/an/a 1n/an/an/an/an/an/a
Johnson& Johnson Pharmaceutical Research and Development
Curated by ChEMBL
Assay Description
Binding affinity to Integrin alpha-v-beta-3 receptor by ELISA assay
Eur J Med Chem 42: 334-43 (2007)
Article DOI: 10.1016/j.ejmech.2006.10.015
BindingDB Entry DOI: 10.7270/Q21J9BKM
ITGAV/ITGB3
(Homo sapiens (Human))
BDBM50166691
(3-Phenyl-3-{5-[2-(5,6,7,8-tetrahydro-[1,8]naphthyr...)
Show SMILES OC(=O)CC(c1ccccc1)n1ccc2cc(OCCc3ccc4CCCNc4n3)ccc12
Show InChI InChI=1S/C27H27N3O3/c31-26(32)18-25(19-5-2-1-3-6-19)30-15-12-21-17-23(10-11-24(21)30)33-16-13-22-9-8-20-7-4-14-28-27(20)29-22/h1-3,5-6,8-12,15,17,25H,4,7,13-14,16,18H2,(H,28,29)(H,31,32)
n/an/a 1n/an/an/an/an/an/a
Johnson& Johnson, Pharmaceutical Research and Development, L.L.C.
Curated by ChEMBL
Assay Description
Inhibitory concentration against alphaV-beta3 integrin
Bioorg Med Chem Lett 15: 2679-84 (2005)
Article DOI: 10.1016/j.bmcl.2005.01.028
BindingDB Entry DOI: 10.7270/Q2N29Z40