BDBM50166746 CHEMBL3798911
SMILES: COc1cc(CCc2cc(Nc3ncnc4cc(ccc34)N3CCNC(C)(C)C3)n[nH]2)cc(OC)c1
InChI Key: InChIKey=SXDMXWVCVPXVFQ-UHFFFAOYSA-N
Data: 1 IC50
Activity Spreadsheet -- Enzyme Inhibition Constant Data from BindingDB
Found 1 hit for monomerid = 50166746
Trg + Lig
Ki
nM
ΔG°
kcal/mole
IC50
nM
Kd
nM
EC50/IC50
nM
koff
s-1
kon
M-1s-1
pHTemp
°C
Fibroblast growth factor receptor 2
(Homo sapiens (Human))
BDBM50166746
(CHEMBL3798911)
Show SMILES COc1cc(CCc2cc(Nc3ncnc4cc(ccc34)N3CCNC(C)(C)C3)n[nH]2)cc(OC)c1
Show InChI InChI=1S/C27H33N7O2/c1-27(2)16-34(10-9-30-27)20-7-8-23-24(14-20)28-17-29-26(23)31-25-13-19(32-33-25)6-5-18-11-21(35-3)15-22(12-18)36-4/h7-8,11-15,17,30H,5-6,9-10,16H2,1-4H3,(H2,28,29,31,32,33)
NCI pathway
Reactome pathway
n/an/a 0.900n/an/an/an/an/an/a
Chinese Academy of Sciences (CAS)
Curated by ChEMBL
Assay Description
Inhibition of recombinant FGFR2 (unknown origin) using (Glu,Tyr)4:1 as substrate incubated for 60 mins by ELISA
Bioorg Med Chem Lett 26: 2594-9 (2016)
Article DOI: 10.1016/j.bmcl.2016.04.028
BindingDB Entry DOI: 10.7270/Q20C4XNM