BDBM50167307 1-Benzo[b]thiophen-2-ylmethyl-5-iodo-1H-indole-2,3-dione::CHEMBL190743::med.21724, Compound 106
SMILES: Ic1ccc2N(Cc3cc4ccccc4s3)C(=O)C(=O)c2c1
InChI Key: InChIKey=MAYSJMBSILUGEG-UHFFFAOYSA-N
Data: 3 IC50
Activity Spreadsheet -- Enzyme Inhibition Constant Data from BindingDB
Found 4 hits for monomerid = 50167307
Trg + Lig
Ki
nM
ΔG°
kcal/mole
IC50
nM
Kd
nM
EC50/IC50
nM
koff
s-1
kon
M-1s-1
pHTemp
°C
Replicase polyprotein 1a
(Human SARS coronavirus (SARS-CoV))
BDBM50167307
(1-Benzo[b]thiophen-2-ylmethyl-5-iodo-1H-indole-2,3...)
Show SMILES Ic1ccc2N(Cc3cc4ccccc4s3)C(=O)C(=O)c2c1
Show InChI InChI=1S/C17H10INO2S/c18-11-5-6-14-13(8-11)16(20)17(21)19(14)9-12-7-10-3-1-2-4-15(10)22-12/h1-8H,9H2
n/an/a 950n/an/an/an/an/an/a
Development Center for Biotechnology
Curated by ChEMBL
Assay Description
In vitro inhibitory concentration against SARS coronavirus main protease (SARS CoV 3C-like protease)
Bioorg Med Chem Lett 15: 3058-62 (2005)
Article DOI: 10.1016/j.bmcl.2005.04.027
BindingDB Entry DOI: 10.7270/Q2H131JB
Replicase polyprotein 1ab
(Human SARS coronavirus (SARS-CoV) (Severe acute re...)
BDBM50167307
(1-Benzo[b]thiophen-2-ylmethyl-5-iodo-1H-indole-2,3...)
Show SMILES Ic1ccc2N(Cc3cc4ccccc4s3)C(=O)C(=O)c2c1
Show InChI InChI=1S/C17H10INO2S/c18-11-5-6-14-13(8-11)16(20)17(21)19(14)9-12-7-10-3-1-2-4-15(10)22-12/h1-8H,9H2
n/an/a 950n/an/an/an/an/an/a
TBA
Citation and Details
Replicase polyprotein 1ab
(Human SARS coronavirus (SARS-CoV) (Severe acute re...)
BDBM50167307
(1-Benzo[b]thiophen-2-ylmethyl-5-iodo-1H-indole-2,3...)
Show SMILES Ic1ccc2N(Cc3cc4ccccc4s3)C(=O)C(=O)c2c1
Show InChI InChI=1S/C17H10INO2S/c18-11-5-6-14-13(8-11)16(20)17(21)19(14)9-12-7-10-3-1-2-4-15(10)22-12/h1-8H,9H2
n/an/a 950n/an/an/an/an/an/a
University of Bonn
Assay Description
This is a review article.
Med Res Rev (2020)
Article DOI: 10.1002/med.21724
BindingDB Entry DOI: 10.7270/Q2JS9ST6
Chymotrypsin-C
(Homo sapiens (Human))
BDBM50167307
(1-Benzo[b]thiophen-2-ylmethyl-5-iodo-1H-indole-2,3...)
Show SMILES Ic1ccc2N(Cc3cc4ccccc4s3)C(=O)C(=O)c2c1
Show InChI InChI=1S/C17H10INO2S/c18-11-5-6-14-13(8-11)16(20)17(21)19(14)9-12-7-10-3-1-2-4-15(10)22-12/h1-8H,9H2
n/an/a 1.00E+3n/an/an/an/an/an/a
Development Center for Biotechnology
Curated by ChEMBL
Assay Description
In vitro inhibitory concentration against Chymotrypsin (serine protease)
Bioorg Med Chem Lett 15: 3058-62 (2005)
Article DOI: 10.1016/j.bmcl.2005.04.027
BindingDB Entry DOI: 10.7270/Q2H131JB