BDBM50167565 1-[1-(2-Isobutylamino-ethyl)-1H-indazol-5-yl]-3-(4-phenoxy-phenyl)-urea::CHEMBL196388
SMILES: CC(C)CNCCn1ncc2cc(NC(=O)Nc3ccc(Oc4ccccc4)cc3)ccc12
InChI Key: InChIKey=SXUROQLTGFUQFZ-UHFFFAOYSA-N
Data: 1 IC50
Activity Spreadsheet -- Enzyme Inhibition Constant Data from BindingDB
Found 1 hit for monomerid = 50167565
Trg + Lig
Ki
nM
ΔG°
kcal/mole
IC50
nM
Kd
nM
EC50/IC50
nM
koff
s-1
kon
M-1s-1
pHTemp
°C
Melanin-concentrating hormone receptor 1
(Mus musculus)
BDBM50167565
(1-[1-(2-Isobutylamino-ethyl)-1H-indazol-5-yl]-3-(4...)
Show SMILES CC(C)CNCCn1ncc2cc(NC(=O)Nc3ccc(Oc4ccccc4)cc3)ccc12
Show InChI InChI=1S/C26H29N5O2/c1-19(2)17-27-14-15-31-25-13-10-22(16-20(25)18-28-31)30-26(32)29-21-8-11-24(12-9-21)33-23-6-4-3-5-7-23/h3-13,16,18-19,27H,14-15,17H2,1-2H3,(H2,29,30,32)
Reactome pathway
n/an/a 1.80n/an/an/an/an/an/a
Abbott Laboratories
Curated by ChEMBL
Assay Description
Inhibitory concentration against mouse Melanin-concentrating hormone receptor 1 expressed in IMR-32 cells using [125I]-MCH
Bioorg Med Chem Lett 15: 2752-7 (2005)
Article DOI: 10.1016/j.bmcl.2005.03.114
BindingDB Entry DOI: 10.7270/Q2QJ7GSD