BDBM50167810 1-(4-fluorophenyl)-4',4',4a,6'-tetramethyl-(4aS,6'R)-spiro[1,4,4a,5,6,7-hexahydrocyclopenta[f]indazole-5,2'-(dihydro-4'H-[1,3]dioxane)]::CHEMBL195967
SMILES: C[C@@H]1CC(C)(C)O[C@@]2(CCC3=Cc4c(C[C@]23C)cnn4-c2ccc(F)cc2)O1
InChI Key: InChIKey=FIAAWQZNRLETPZ-AIYSXCBHSA-N
Data: 1 IC50
Activity Spreadsheet -- Enzyme Inhibition Constant Data from BindingDB
Found 1 hit for monomerid = 50167810
Trg + Lig
Ki
nM
ΔG°
kcal/mole
IC50
nM
Kd
nM
EC50/IC50
nM
koff
s-1
kon
M-1s-1
pHTemp
°C
Glucocorticoid receptor
(Homo sapiens (Human))
BDBM50167810
(1-(4-fluorophenyl)-4',4',4a,6'-tetramethyl-(4aS,6'...)
Show SMILES C[C@@H]1CC(C)(C)O[C@@]2(CCC3=Cc4c(C[C@]23C)cnn4-c2ccc(F)cc2)O1 |t:10|
Show InChI InChI=1S/C23H27FN2O2/c1-15-12-21(2,3)28-23(27-15)10-9-17-11-20-16(13-22(17,23)4)14-25-26(20)19-7-5-18(24)6-8-19/h5-8,11,14-15H,9-10,12-13H2,1-4H3/t15-,22+,23-/m1/s1
n/an/a 2.10n/an/an/an/an/an/a
Merck Research Laboratories
Curated by ChEMBL
Assay Description
Inhibition of human glucocorticoid receptor alpha isoform
Bioorg Med Chem Lett 15: 2926-31 (2005)
Article DOI: 10.1016/j.bmcl.2005.03.027
BindingDB Entry DOI: 10.7270/Q2X34X0Q