BDBM50167933 CHEMBL370297::N-{4-[4-(2,3-dichlorophenyl)piperazin-1-yl]butyl}-1-ruthena-1,1'-spirobi[pentacyclo[2.2.0.0^{1,3}.0^{1,5}.0^{2,6}]hexane]-2,2',4,4'-tetraene-6-carboxamide
SMILES: [Ru]123456789C%10=C1C2C3=C4%10.Clc1c(Cl)c(ccc1)N1CCN(CC1)CCCCNC(C51C6=C7C8=C91)=O
InChI Key: InChIKey=KCQKJFFKZXDHTQ-UHFFFAOYSA-N
Data: 6 KI  3 EC50
Activity Spreadsheet -- Enzyme Inhibition Constant Data from BindingDB
Found 9 hits for monomerid = 50167933
Trg + Lig
Ki
nM
ΔG°
kcal/mole
IC50
nM
Kd
nM
EC50/IC50
nM
koff
s-1
kon
M-1s-1
pHTemp
°C
D(4) dopamine receptor
(Homo sapiens (Human))
BDBM50167933
(CHEMBL370297 | N-{4-[4-(2,3-dichlorophenyl)piperaz...)
Show SMILES [Ru]123456789C%10=C1C2C3=C4%10.Clc1c(Cl)c(ccc1)N1CCN(CC1)CCCCNC(C51C6=C7C8=C91)=O |c:1,7,35,39,(.22,-2.99,;-.23,-4.26,;-.88,-5.18,;-1.96,-4.82,;-1.96,-3.7,;-.89,-3.35,;19.91,.72,;18.57,1.49,;17.23,.72,;17.23,-.83,;15.9,1.49,;15.9,3.03,;17.23,3.8,;18.57,3.03,;14.55,.72,;14.57,-.83,;13.22,-1.59,;11.89,-.8,;11.89,.74,;13.22,1.5,;10.55,-1.57,;9.21,-.8,;7.86,-1.57,;6.53,-.78,;5.2,-1.55,;3.87,-.77,;2.53,-1.55,;2.53,-2.67,;1.45,-3.02,;.78,-2.11,;1.45,-1.2,;3.86,.77,)|
Show InChI InChI=1S/C20H20Cl2N3O.C5H.Ru/c21-17-8-5-9-18(19(17)22)25-14-12-24(13-15-25)11-4-3-10-23-20(26)16-6-1-2-7-16;1-2-4-5-3-1;/h5,8-9H,3-4,10-15H2,(H,23,26);1H;
Reactome pathway
0.600n/an/an/an/an/an/an/an/a
Friedrich Alexander University
Curated by ChEMBL
Assay Description
Inhibition of [3H]spiperone binding to human dopamine receptor D4.4 expressed in Chinese hamster ovary cells
J Med Chem 48: 3696-9 (2005)
Article DOI: 10.1021/jm050170s
BindingDB Entry DOI: 10.7270/Q20K29BF
D(3) dopamine receptor
(Homo sapiens (Human))
BDBM50167933
(CHEMBL370297 | N-{4-[4-(2,3-dichlorophenyl)piperaz...)
Show SMILES [Ru]123456789C%10=C1C2C3=C4%10.Clc1c(Cl)c(ccc1)N1CCN(CC1)CCCCNC(C51C6=C7C8=C91)=O |c:1,7,35,39,(.22,-2.99,;-.23,-4.26,;-.88,-5.18,;-1.96,-4.82,;-1.96,-3.7,;-.89,-3.35,;19.91,.72,;18.57,1.49,;17.23,.72,;17.23,-.83,;15.9,1.49,;15.9,3.03,;17.23,3.8,;18.57,3.03,;14.55,.72,;14.57,-.83,;13.22,-1.59,;11.89,-.8,;11.89,.74,;13.22,1.5,;10.55,-1.57,;9.21,-.8,;7.86,-1.57,;6.53,-.78,;5.2,-1.55,;3.87,-.77,;2.53,-1.55,;2.53,-2.67,;1.45,-3.02,;.78,-2.11,;1.45,-1.2,;3.86,.77,)|
Show InChI InChI=1S/C20H20Cl2N3O.C5H.Ru/c21-17-8-5-9-18(19(17)22)25-14-12-24(13-15-25)11-4-3-10-23-20(26)16-6-1-2-7-16;1-2-4-5-3-1;/h5,8-9H,3-4,10-15H2,(H,23,26);1H;
0.840n/an/an/an/an/an/an/an/a
Friedrich Alexander University
Curated by ChEMBL
Assay Description
Inhibition of [3H]spiperone binding to human dopamine receptor D3 expressed in Chinese hamster ovary cells
J Med Chem 48: 3696-9 (2005)
Article DOI: 10.1021/jm050170s
BindingDB Entry DOI: 10.7270/Q20K29BF
D(2) dopamine receptor
(Homo sapiens (Human))
BDBM50167933
(CHEMBL370297 | N-{4-[4-(2,3-dichlorophenyl)piperaz...)
Show SMILES [Ru]123456789C%10=C1C2C3=C4%10.Clc1c(Cl)c(ccc1)N1CCN(CC1)CCCCNC(C51C6=C7C8=C91)=O |c:1,7,35,39,(.22,-2.99,;-.23,-4.26,;-.88,-5.18,;-1.96,-4.82,;-1.96,-3.7,;-.89,-3.35,;19.91,.72,;18.57,1.49,;17.23,.72,;17.23,-.83,;15.9,1.49,;15.9,3.03,;17.23,3.8,;18.57,3.03,;14.55,.72,;14.57,-.83,;13.22,-1.59,;11.89,-.8,;11.89,.74,;13.22,1.5,;10.55,-1.57,;9.21,-.8,;7.86,-1.57,;6.53,-.78,;5.2,-1.55,;3.87,-.77,;2.53,-1.55,;2.53,-2.67,;1.45,-3.02,;.78,-2.11,;1.45,-1.2,;3.86,.77,)|
Show InChI InChI=1S/C20H20Cl2N3O.C5H.Ru/c21-17-8-5-9-18(19(17)22)25-14-12-24(13-15-25)11-4-3-10-23-20(26)16-6-1-2-7-16;1-2-4-5-3-1;/h5,8-9H,3-4,10-15H2,(H,23,26);1H;
Reactome pathway
12n/an/an/an/an/an/an/an/a
Friedrich Alexander University
Curated by ChEMBL
Assay Description
Inhibition of [3H]spiperone binding to human dopamine receptor D2 short expressed in Chinese hamster ovary cells
J Med Chem 48: 3696-9 (2005)
Article DOI: 10.1021/jm050170s
BindingDB Entry DOI: 10.7270/Q20K29BF
D(2) dopamine receptor
(Homo sapiens (Human))
BDBM50167933
(CHEMBL370297 | N-{4-[4-(2,3-dichlorophenyl)piperaz...)
Show SMILES [Ru]123456789C%10=C1C2C3=C4%10.Clc1c(Cl)c(ccc1)N1CCN(CC1)CCCCNC(C51C6=C7C8=C91)=O |c:1,7,35,39,(.22,-2.99,;-.23,-4.26,;-.88,-5.18,;-1.96,-4.82,;-1.96,-3.7,;-.89,-3.35,;19.91,.72,;18.57,1.49,;17.23,.72,;17.23,-.83,;15.9,1.49,;15.9,3.03,;17.23,3.8,;18.57,3.03,;14.55,.72,;14.57,-.83,;13.22,-1.59,;11.89,-.8,;11.89,.74,;13.22,1.5,;10.55,-1.57,;9.21,-.8,;7.86,-1.57,;6.53,-.78,;5.2,-1.55,;3.87,-.77,;2.53,-1.55,;2.53,-2.67,;1.45,-3.02,;.78,-2.11,;1.45,-1.2,;3.86,.77,)|
Show InChI InChI=1S/C20H20Cl2N3O.C5H.Ru/c21-17-8-5-9-18(19(17)22)25-14-12-24(13-15-25)11-4-3-10-23-20(26)16-6-1-2-7-16;1-2-4-5-3-1;/h5,8-9H,3-4,10-15H2,(H,23,26);1H;
Reactome pathway
43n/an/an/an/an/an/an/an/a
Friedrich Alexander University
Curated by ChEMBL
Assay Description
Inhibition of [3H]spiperone binding to human dopamine receptor D2 long expressed in Chinese hamster ovary cells
J Med Chem 48: 3696-9 (2005)
Article DOI: 10.1021/jm050170s
BindingDB Entry DOI: 10.7270/Q20K29BF
5-hydroxytryptamine receptor 1A
(Homo sapiens (Human))
BDBM50167933
(CHEMBL370297 | N-{4-[4-(2,3-dichlorophenyl)piperaz...)
Show SMILES [Ru]123456789C%10=C1C2C3=C4%10.Clc1c(Cl)c(ccc1)N1CCN(CC1)CCCCNC(C51C6=C7C8=C91)=O |c:1,7,35,39,(.22,-2.99,;-.23,-4.26,;-.88,-5.18,;-1.96,-4.82,;-1.96,-3.7,;-.89,-3.35,;19.91,.72,;18.57,1.49,;17.23,.72,;17.23,-.83,;15.9,1.49,;15.9,3.03,;17.23,3.8,;18.57,3.03,;14.55,.72,;14.57,-.83,;13.22,-1.59,;11.89,-.8,;11.89,.74,;13.22,1.5,;10.55,-1.57,;9.21,-.8,;7.86,-1.57,;6.53,-.78,;5.2,-1.55,;3.87,-.77,;2.53,-1.55,;2.53,-2.67,;1.45,-3.02,;.78,-2.11,;1.45,-1.2,;3.86,.77,)|
Show InChI InChI=1S/C20H20Cl2N3O.C5H.Ru/c21-17-8-5-9-18(19(17)22)25-14-12-24(13-15-25)11-4-3-10-23-20(26)16-6-1-2-7-16;1-2-4-5-3-1;/h5,8-9H,3-4,10-15H2,(H,23,26);1H;
77n/an/an/an/an/an/an/an/a
Friedrich Alexander University
Curated by ChEMBL
Assay Description
Binding affinity towards porcine serotonin receptor 5-HT1A using [3H]8-OH-DPAT
J Med Chem 48: 3696-9 (2005)
Article DOI: 10.1021/jm050170s
BindingDB Entry DOI: 10.7270/Q20K29BF
Dopamine D1 receptor
(Sus scrofa)
BDBM50167933
(CHEMBL370297 | N-{4-[4-(2,3-dichlorophenyl)piperaz...)
Show SMILES [Ru]123456789C%10=C1C2C3=C4%10.Clc1c(Cl)c(ccc1)N1CCN(CC1)CCCCNC(C51C6=C7C8=C91)=O |c:1,7,35,39,(.22,-2.99,;-.23,-4.26,;-.88,-5.18,;-1.96,-4.82,;-1.96,-3.7,;-.89,-3.35,;19.91,.72,;18.57,1.49,;17.23,.72,;17.23,-.83,;15.9,1.49,;15.9,3.03,;17.23,3.8,;18.57,3.03,;14.55,.72,;14.57,-.83,;13.22,-1.59,;11.89,-.8,;11.89,.74,;13.22,1.5,;10.55,-1.57,;9.21,-.8,;7.86,-1.57,;6.53,-.78,;5.2,-1.55,;3.87,-.77,;2.53,-1.55,;2.53,-2.67,;1.45,-3.02,;.78,-2.11,;1.45,-1.2,;3.86,.77,)|
Show InChI InChI=1S/C20H20Cl2N3O.C5H.Ru/c21-17-8-5-9-18(19(17)22)25-14-12-24(13-15-25)11-4-3-10-23-20(26)16-6-1-2-7-16;1-2-4-5-3-1;/h5,8-9H,3-4,10-15H2,(H,23,26);1H;
330n/an/an/an/an/an/an/an/a
Friedrich Alexander University
Curated by ChEMBL
Assay Description
Inhibition of [3H]-SCH- 23390 binding to dopamine receptor D1 of porcine striatal membranes
J Med Chem 48: 3696-9 (2005)
Article DOI: 10.1021/jm050170s
BindingDB Entry DOI: 10.7270/Q20K29BF
D(4) dopamine receptor
(Homo sapiens (Human))
BDBM50167933
(CHEMBL370297 | N-{4-[4-(2,3-dichlorophenyl)piperaz...)
Show SMILES [Ru]123456789C%10=C1C2C3=C4%10.Clc1c(Cl)c(ccc1)N1CCN(CC1)CCCCNC(C51C6=C7C8=C91)=O |c:1,7,35,39,(.22,-2.99,;-.23,-4.26,;-.88,-5.18,;-1.96,-4.82,;-1.96,-3.7,;-.89,-3.35,;19.91,.72,;18.57,1.49,;17.23,.72,;17.23,-.83,;15.9,1.49,;15.9,3.03,;17.23,3.8,;18.57,3.03,;14.55,.72,;14.57,-.83,;13.22,-1.59,;11.89,-.8,;11.89,.74,;13.22,1.5,;10.55,-1.57,;9.21,-.8,;7.86,-1.57,;6.53,-.78,;5.2,-1.55,;3.87,-.77,;2.53,-1.55,;2.53,-2.67,;1.45,-3.02,;.78,-2.11,;1.45,-1.2,;3.86,.77,)|
Show InChI InChI=1S/C20H20Cl2N3O.C5H.Ru/c21-17-8-5-9-18(19(17)22)25-14-12-24(13-15-25)11-4-3-10-23-20(26)16-6-1-2-7-16;1-2-4-5-3-1;/h5,8-9H,3-4,10-15H2,(H,23,26);1H;
Reactome pathway
n/an/an/an/a 14n/an/an/an/a
Friedrich Alexander University
Curated by ChEMBL
Assay Description
Effective concentration for [35S]GTP-gamma-S, binding in CHO-K1 cells expressing human dopamine D4 receptor
J Med Chem 48: 3696-9 (2005)
Article DOI: 10.1021/jm050170s
BindingDB Entry DOI: 10.7270/Q20K29BF
D(4) dopamine receptor
(Homo sapiens (Human))
BDBM50167933
(CHEMBL370297 | N-{4-[4-(2,3-dichlorophenyl)piperaz...)
Show SMILES [Ru]123456789C%10=C1C2C3=C4%10.Clc1c(Cl)c(ccc1)N1CCN(CC1)CCCCNC(C51C6=C7C8=C91)=O |c:1,7,35,39,(.22,-2.99,;-.23,-4.26,;-.88,-5.18,;-1.96,-4.82,;-1.96,-3.7,;-.89,-3.35,;19.91,.72,;18.57,1.49,;17.23,.72,;17.23,-.83,;15.9,1.49,;15.9,3.03,;17.23,3.8,;18.57,3.03,;14.55,.72,;14.57,-.83,;13.22,-1.59,;11.89,-.8,;11.89,.74,;13.22,1.5,;10.55,-1.57,;9.21,-.8,;7.86,-1.57,;6.53,-.78,;5.2,-1.55,;3.87,-.77,;2.53,-1.55,;2.53,-2.67,;1.45,-3.02,;.78,-2.11,;1.45,-1.2,;3.86,.77,)|
Show InChI InChI=1S/C20H20Cl2N3O.C5H.Ru/c21-17-8-5-9-18(19(17)22)25-14-12-24(13-15-25)11-4-3-10-23-20(26)16-6-1-2-7-16;1-2-4-5-3-1;/h5,8-9H,3-4,10-15H2,(H,23,26);1H;
Reactome pathway
n/an/an/an/a 35n/an/an/an/a
Friedrich Alexander University
Curated by ChEMBL
Assay Description
Effective concentration from [3H]thymidine uptake assay in CHO10001 cells expressing human Dopamine receptor D4.2
J Med Chem 48: 3696-9 (2005)
Article DOI: 10.1021/jm050170s
BindingDB Entry DOI: 10.7270/Q20K29BF
D(3) dopamine receptor
(Homo sapiens (Human))
BDBM50167933
(CHEMBL370297 | N-{4-[4-(2,3-dichlorophenyl)piperaz...)
Show SMILES [Ru]123456789C%10=C1C2C3=C4%10.Clc1c(Cl)c(ccc1)N1CCN(CC1)CCCCNC(C51C6=C7C8=C91)=O |c:1,7,35,39,(.22,-2.99,;-.23,-4.26,;-.88,-5.18,;-1.96,-4.82,;-1.96,-3.7,;-.89,-3.35,;19.91,.72,;18.57,1.49,;17.23,.72,;17.23,-.83,;15.9,1.49,;15.9,3.03,;17.23,3.8,;18.57,3.03,;14.55,.72,;14.57,-.83,;13.22,-1.59,;11.89,-.8,;11.89,.74,;13.22,1.5,;10.55,-1.57,;9.21,-.8,;7.86,-1.57,;6.53,-.78,;5.2,-1.55,;3.87,-.77,;2.53,-1.55,;2.53,-2.67,;1.45,-3.02,;.78,-2.11,;1.45,-1.2,;3.86,.77,)|
Show InChI InChI=1S/C20H20Cl2N3O.C5H.Ru/c21-17-8-5-9-18(19(17)22)25-14-12-24(13-15-25)11-4-3-10-23-20(26)16-6-1-2-7-16;1-2-4-5-3-1;/h5,8-9H,3-4,10-15H2,(H,23,26);1H;
n/an/an/an/a 9.10n/an/an/an/a
Friedrich Alexander University
Curated by ChEMBL
Assay Description
Effective concentration in [3H]thymidine uptake assay by CHO dhfr- mutant cells expressing human D3 receptor
J Med Chem 48: 3696-9 (2005)
Article DOI: 10.1021/jm050170s
BindingDB Entry DOI: 10.7270/Q20K29BF