BDBM50168331 3-(2-Fluoro-4-hydroxy-phenyl)-7-hydroxy-naphthalene-1-carbonitrile::CHEMBL363634
SMILES: Oc1ccc(c(F)c1)-c1cc(C#N)c2cc(O)ccc2c1
InChI Key: InChIKey=TYKGMSWZEALPBQ-UHFFFAOYSA-N
Data: 2 IC50
Activity Spreadsheet -- Enzyme Inhibition Constant Data from BindingDB
Found 2 hits for monomerid = 50168331
Trg + Lig
Ki
nM
ΔG°
kcal/mole
IC50
nM
Kd
nM
EC50/IC50
nM
koff
s-1
kon
M-1s-1
pHTemp
°C
Estrogen receptor
(Homo sapiens (Human))
BDBM50168331
(3-(2-Fluoro-4-hydroxy-phenyl)-7-hydroxy-naphthalen...)
Show SMILES Oc1ccc(c(F)c1)-c1cc(C#N)c2cc(O)ccc2c1
Show InChI InChI=1S/C17H10FNO2/c18-17-8-14(21)3-4-15(17)11-5-10-1-2-13(20)7-16(10)12(6-11)9-19/h1-8,20-21H
n/an/a 26n/an/an/an/an/an/a
Wyeth Research
Curated by ChEMBL
Assay Description
Inhibition of [3H]-17-beta-estradiol binding to human estrogen receptor alpha expressed in Escherichia coli
J Med Chem 48: 3953-79 (2005)
Article DOI: 10.1021/jm058173s
BindingDB Entry DOI: 10.7270/Q2QF8SF0
Estradiol receptor beta (ERβ)
(Homo sapiens (Human))
BDBM50168331
(3-(2-Fluoro-4-hydroxy-phenyl)-7-hydroxy-naphthalen...)
Show SMILES Oc1ccc(c(F)c1)-c1cc(C#N)c2cc(O)ccc2c1
Show InChI InChI=1S/C17H10FNO2/c18-17-8-14(21)3-4-15(17)11-5-10-1-2-13(20)7-16(10)12(6-11)9-19/h1-8,20-21H
n/an/a 0.5n/an/an/an/an/an/a
Wyeth Research
Curated by ChEMBL
Assay Description
Inhibition of [3H]-17-beta-estradiol binding to human estrogen receptor beta expressed in Escherichia coli
J Med Chem 48: 3953-79 (2005)
Article DOI: 10.1021/jm058173s
BindingDB Entry DOI: 10.7270/Q2QF8SF0