null
SMILES: NC(=O)c1cncc(OCc2cccc(NC(=O)c3ccc(F)c(F)c3)c2)c1
InChI Key: InChIKey=JWIHWUHGPIGDBA-UHFFFAOYSA-N
Activity Spreadsheet -- Enzyme Inhibition Constant Data from BindingDB
Found 3 hits for monomerid = 50168505
Trg + Lig
Ki
nM
ΔG°
kcal/mole
IC50
nM
Kd
nM
EC50/IC50
nM
koff
s-1
kon
M-1s-1
pHTemp
°C
NAD-dependent protein deacetylase sirtuin-1
(Homo sapiens (Human))
BDBM50168505
(CHEMBL3805426)
Show SMILES NC(=O)c1cncc(OCc2cccc(NC(=O)c3ccc(F)c(F)c3)c2)c1
Show InChI InChI=1S/C20H15F2N3O3/c21-17-5-4-13(8-18(17)22)20(27)25-15-3-1-2-12(6-15)11-28-16-7-14(19(23)26)9-24-10-16/h1-10H,11H2,(H2,23,26)(H,25,27)
NCI pathway
Reactome pathway
n/an/a 7.97E+3n/an/an/an/an/an/a
University of Minnesota
Curated by ChEMBL
Assay Description
Inhibition of recombinant human N-terminal His-tagged SIRT1 (1 to 747 residues) expressed in Escherichia coli using Ac-RHK-K(Ac)-AMC as substrate inc...
J Med Chem 59: 2928-41 (2016)
Article DOI: 10.1021/acs.jmedchem.5b01376
BindingDB Entry DOI: 10.7270/Q2Z89F9W
NAD-dependent protein deacetylase sirtuin-3, mitochondrial
(Homo sapiens (Human))
BDBM50168505
(CHEMBL3805426)
Show SMILES NC(=O)c1cncc(OCc2cccc(NC(=O)c3ccc(F)c(F)c3)c2)c1
Show InChI InChI=1S/C20H15F2N3O3/c21-17-5-4-13(8-18(17)22)20(27)25-15-3-1-2-12(6-15)11-28-16-7-14(19(23)26)9-24-10-16/h1-10H,11H2,(H2,23,26)(H,25,27)
n/an/a 1.56E+3n/an/an/an/an/an/a
University of Minnesota
Curated by ChEMBL
Assay Description
Inhibition of human SIRT3 (102 to 399 residues) expressed in Escherichia coli using Ac-RHK-K(Ac)-AMC as substrate incubated for 2 hrs by fluorescence...
J Med Chem 59: 2928-41 (2016)
Article DOI: 10.1021/acs.jmedchem.5b01376
BindingDB Entry DOI: 10.7270/Q2Z89F9W
NAD-dependent protein deacetylase sirtuin-2
(Homo sapiens (Human))
BDBM50168505
(CHEMBL3805426)
Show SMILES NC(=O)c1cncc(OCc2cccc(NC(=O)c3ccc(F)c(F)c3)c2)c1
Show InChI InChI=1S/C20H15F2N3O3/c21-17-5-4-13(8-18(17)22)20(27)25-15-3-1-2-12(6-15)11-28-16-7-14(19(23)26)9-24-10-16/h1-10H,11H2,(H2,23,26)(H,25,27)
NCI pathway
n/an/a 42n/an/an/an/an/an/a
University of Minnesota
Curated by ChEMBL
Assay Description
Inhibition of recombinant human C-terminal His-tagged SIRT2 (50 to 389 residues) expressed in Escherichia coli using Ac-RHK-K(Ac)-AMC as substrate in...
J Med Chem 59: 2928-41 (2016)
Article DOI: 10.1021/acs.jmedchem.5b01376
BindingDB Entry DOI: 10.7270/Q2Z89F9W