BDBM50168694 1-((R)-2-Amino-2-phenyl-ethyl)-3-(2-bromo-6-fluoro-benzyl)-5-(2-fluoro-3-methoxy-phenyl)-[1,3,5]triazinane-2,4,6-trione::CHEMBL368511
SMILES: COc1cccc(c1F)-n1c(=O)n(C[C@H](N)c2ccccc2)c(=O)n(Cc2c(F)cccc2Br)c1=O
InChI Key: InChIKey=JPJCBKFCBLFFDG-IBGZPJMESA-N
Data: 3 KI  1 IC50
Activity Spreadsheet -- Enzyme Inhibition Constant Data from BindingDB
Found 4 hits for monomerid = 50168694
Trg + Lig
Ki
nM
ΔG°
kcal/mole
IC50
nM
Kd
nM
EC50/IC50
nM
koff
s-1
kon
M-1s-1
pHTemp
°C
Gonadotropin releasing hormone 1 (GnRHR1)
(Homo sapiens (Human))
BDBM50168694
(1-((R)-2-Amino-2-phenyl-ethyl)-3-(2-bromo-6-fluoro...)
Show SMILES COc1cccc(c1F)-n1c(=O)n(C[C@H](N)c2ccccc2)c(=O)n(Cc2c(F)cccc2Br)c1=O |wD:14.15,(8.68,1.49,;7.35,.72,;7.36,-.82,;8.7,-1.59,;8.7,-3.13,;7.37,-3.9,;6.04,-3.13,;6.03,-1.61,;4.7,-.85,;4.71,-3.92,;3.37,-3.15,;3.37,-1.61,;2.04,-3.92,;.71,-3.15,;-.62,-3.93,;-1.4,-5.26,;-1.96,-3.16,;-3.31,-3.93,;-4.64,-3.16,;-4.64,-1.61,;-3.31,-.84,;-1.96,-1.61,;2.04,-5.46,;.71,-6.23,;3.38,-6.23,;3.38,-7.77,;4.72,-8.54,;6.04,-7.75,;7.12,-6.66,;7.37,-8.52,;7.38,-10.06,;6.05,-10.83,;4.71,-10.08,;3.38,-10.85,;4.71,-5.46,;6.05,-6.21,)|
Show InChI InChI=1S/C25H21BrF2N4O4/c1-36-21-12-6-11-20(22(21)28)32-24(34)30(13-16-17(26)9-5-10-18(16)27)23(33)31(25(32)35)14-19(29)15-7-3-2-4-8-15/h2-12,19H,13-14,29H2,1H3/t19-/m0/s1
2n/an/an/an/an/an/an/an/a
Neurocrine Biosciences, Inc.
Curated by ChEMBL
Assay Description
In vitro ability to inhibit des-Gly[125I-Tyr, DLeu, NMeLeu,Pro-NEt]-GnRH radioligand binding to the cloned human GnRH receptor stably expressed in HE...
Bioorg Med Chem Lett 15: 3685-90 (2005)
Article DOI: 10.1016/j.bmcl.2005.05.038
BindingDB Entry DOI: 10.7270/Q2DZ07TN
Gonadotropin releasing hormone 1 (GnRHR1)
(Homo sapiens (Human))
BDBM50168694
(1-((R)-2-Amino-2-phenyl-ethyl)-3-(2-bromo-6-fluoro...)
Show SMILES COc1cccc(c1F)-n1c(=O)n(C[C@H](N)c2ccccc2)c(=O)n(Cc2c(F)cccc2Br)c1=O |wD:14.15,(8.68,1.49,;7.35,.72,;7.36,-.82,;8.7,-1.59,;8.7,-3.13,;7.37,-3.9,;6.04,-3.13,;6.03,-1.61,;4.7,-.85,;4.71,-3.92,;3.37,-3.15,;3.37,-1.61,;2.04,-3.92,;.71,-3.15,;-.62,-3.93,;-1.4,-5.26,;-1.96,-3.16,;-3.31,-3.93,;-4.64,-3.16,;-4.64,-1.61,;-3.31,-.84,;-1.96,-1.61,;2.04,-5.46,;.71,-6.23,;3.38,-6.23,;3.38,-7.77,;4.72,-8.54,;6.04,-7.75,;7.12,-6.66,;7.37,-8.52,;7.38,-10.06,;6.05,-10.83,;4.71,-10.08,;3.38,-10.85,;4.71,-5.46,;6.05,-6.21,)|
Show InChI InChI=1S/C25H21BrF2N4O4/c1-36-21-12-6-11-20(22(21)28)32-24(34)30(13-16-17(26)9-5-10-18(16)27)23(33)31(25(32)35)14-19(29)15-7-3-2-4-8-15/h2-12,19H,13-14,29H2,1H3/t19-/m0/s1
24n/an/an/an/an/an/an/an/a
Neurocrine Biosciences, Inc.
Curated by ChEMBL
Assay Description
Inhibition constant against monkey GnRH receptor
Bioorg Med Chem Lett 15: 3685-90 (2005)
Article DOI: 10.1016/j.bmcl.2005.05.038
BindingDB Entry DOI: 10.7270/Q2DZ07TN
Gonadotropin-releasing hormone receptor
(Rattus norvegicus)
BDBM50168694
(1-((R)-2-Amino-2-phenyl-ethyl)-3-(2-bromo-6-fluoro...)
Show SMILES COc1cccc(c1F)-n1c(=O)n(C[C@H](N)c2ccccc2)c(=O)n(Cc2c(F)cccc2Br)c1=O |wD:14.15,(8.68,1.49,;7.35,.72,;7.36,-.82,;8.7,-1.59,;8.7,-3.13,;7.37,-3.9,;6.04,-3.13,;6.03,-1.61,;4.7,-.85,;4.71,-3.92,;3.37,-3.15,;3.37,-1.61,;2.04,-3.92,;.71,-3.15,;-.62,-3.93,;-1.4,-5.26,;-1.96,-3.16,;-3.31,-3.93,;-4.64,-3.16,;-4.64,-1.61,;-3.31,-.84,;-1.96,-1.61,;2.04,-5.46,;.71,-6.23,;3.38,-6.23,;3.38,-7.77,;4.72,-8.54,;6.04,-7.75,;7.12,-6.66,;7.37,-8.52,;7.38,-10.06,;6.05,-10.83,;4.71,-10.08,;3.38,-10.85,;4.71,-5.46,;6.05,-6.21,)|
Show InChI InChI=1S/C25H21BrF2N4O4/c1-36-21-12-6-11-20(22(21)28)32-24(34)30(13-16-17(26)9-5-10-18(16)27)23(33)31(25(32)35)14-19(29)15-7-3-2-4-8-15/h2-12,19H,13-14,29H2,1H3/t19-/m0/s1
2.30E+3n/an/an/an/an/an/an/an/a
Neurocrine Biosciences, Inc.
Curated by ChEMBL
Assay Description
Inhibition constant against rat GnRH receptor
Bioorg Med Chem Lett 15: 3685-90 (2005)
Article DOI: 10.1016/j.bmcl.2005.05.038
BindingDB Entry DOI: 10.7270/Q2DZ07TN
Gonadotropin releasing hormone 1 (GnRHR1)
(Homo sapiens (Human))
BDBM50168694
(1-((R)-2-Amino-2-phenyl-ethyl)-3-(2-bromo-6-fluoro...)
Show SMILES COc1cccc(c1F)-n1c(=O)n(C[C@H](N)c2ccccc2)c(=O)n(Cc2c(F)cccc2Br)c1=O |wD:14.15,(8.68,1.49,;7.35,.72,;7.36,-.82,;8.7,-1.59,;8.7,-3.13,;7.37,-3.9,;6.04,-3.13,;6.03,-1.61,;4.7,-.85,;4.71,-3.92,;3.37,-3.15,;3.37,-1.61,;2.04,-3.92,;.71,-3.15,;-.62,-3.93,;-1.4,-5.26,;-1.96,-3.16,;-3.31,-3.93,;-4.64,-3.16,;-4.64,-1.61,;-3.31,-.84,;-1.96,-1.61,;2.04,-5.46,;.71,-6.23,;3.38,-6.23,;3.38,-7.77,;4.72,-8.54,;6.04,-7.75,;7.12,-6.66,;7.37,-8.52,;7.38,-10.06,;6.05,-10.83,;4.71,-10.08,;3.38,-10.85,;4.71,-5.46,;6.05,-6.21,)|
Show InChI InChI=1S/C25H21BrF2N4O4/c1-36-21-12-6-11-20(22(21)28)32-24(34)30(13-16-17(26)9-5-10-18(16)27)23(33)31(25(32)35)14-19(29)15-7-3-2-4-8-15/h2-12,19H,13-14,29H2,1H3/t19-/m0/s1
n/an/a 33n/an/an/an/an/an/a
Neurocrine Biosciences, Inc.
Curated by ChEMBL
Assay Description
Inhibition of human GnRH receptor stimulated inositol phosphate accumulation in RBL cells
Bioorg Med Chem Lett 15: 3685-90 (2005)
Article DOI: 10.1016/j.bmcl.2005.05.038
BindingDB Entry DOI: 10.7270/Q2DZ07TN