BDBM50168771 3-[1-(4-Chloro-benzyl)-3-(3,3-dimethyl-butyryl)-5-isopropyl-1H-indol-2-yl]-2,2-dimethyl-propionic acid::CHEMBL181236
SMILES: CC(C)c1ccc2n(Cc3ccc(Cl)cc3)c(CC(C)(C)C(O)=O)c(C(=O)CC(C)(C)C)c2c1
InChI Key: InChIKey=SMASQMIVJBSYQN-UHFFFAOYSA-N
Data: 2 IC50
Activity Spreadsheet -- Enzyme Inhibition Constant Data from BindingDB
Found 2 hits for monomerid = 50168771
Trg + Lig
Ki
nM
ΔG°
kcal/mole
IC50
nM
Kd
nM
EC50/IC50
nM
koff
s-1
kon
M-1s-1
pHTemp
°C
Prostaglandin E synthase
(Homo sapiens (Human))
BDBM50168771
(3-[1-(4-Chloro-benzyl)-3-(3,3-dimethyl-butyryl)-5-...)
Show SMILES CC(C)c1ccc2n(Cc3ccc(Cl)cc3)c(CC(C)(C)C(O)=O)c(C(=O)CC(C)(C)C)c2c1
Show InChI InChI=1S/C29H36ClNO3/c1-18(2)20-10-13-23-22(14-20)26(25(32)16-28(3,4)5)24(15-29(6,7)27(33)34)31(23)17-19-8-11-21(30)12-9-19/h8-14,18H,15-17H2,1-7H3,(H,33,34)
Reactome pathway
n/an/a 260n/an/an/an/an/an/a
University of Innsbruck
Curated by ChEMBL
Assay Description
Inhibition of human microsomal PGES1 in cell-free system assessed as inhibition of conversion of PGH2 to PGE2 by HPLC assay
J Med Chem 54: 3163-74 (2011)
Article DOI: 10.1021/jm101309g
BindingDB Entry DOI: 10.7270/Q2MS3T3J
Prostaglandin E synthase 2
(Homo sapiens (Human))
BDBM50168771
(3-[1-(4-Chloro-benzyl)-3-(3,3-dimethyl-butyryl)-5-...)
Show SMILES CC(C)c1ccc2n(Cc3ccc(Cl)cc3)c(CC(C)(C)C(O)=O)c(C(=O)CC(C)(C)C)c2c1
Show InChI InChI=1S/C29H36ClNO3/c1-18(2)20-10-13-23-22(14-20)26(25(32)16-28(3,4)5)24(15-29(6,7)27(33)34)31(23)17-19-8-11-21(30)12-9-19/h8-14,18H,15-17H2,1-7H3,(H,33,34)
n/an/a 250n/an/an/an/an/an/a
Merck Frosst Centre for Therapeutic Research
Curated by ChEMBL
Assay Description
Inhibitory concentration against human prostaglandin E2 synthase (mPGES-1)
Bioorg Med Chem Lett 15: 3352-5 (2005)
Article DOI: 10.1016/j.bmcl.2005.05.027
BindingDB Entry DOI: 10.7270/Q21R6Q1X