BDBM50168867 4-(7-Bromo-1-ethyl-1H-imidazo[4,5-c]pyridin-2-yl)-furazan-3-ylamine::CHEMBL365832
SMILES: CCn1c(nc2cncc(Br)c12)-c1nonc1N
InChI Key: InChIKey=FNMHGQSBPQSGMV-UHFFFAOYSA-N
Data: 1 IC50
Activity Spreadsheet -- Enzyme Inhibition Constant Data from BindingDB
Found 1 hit for monomerid = 50168867
Trg + Lig
Ki
nM
ΔG°
kcal/mole
IC50
nM
Kd
nM
EC50/IC50
nM
koff
s-1
kon
M-1s-1
pHTemp
°C
Ribosomal protein S6 kinase alpha 5
(Homo sapiens (Human))
BDBM50168867
(4-(7-Bromo-1-ethyl-1H-imidazo[4,5-c]pyridin-2-yl)-...)
Show SMILES CCn1c(nc2cncc(Br)c12)-c1nonc1N
Show InChI InChI=1S/C10H9BrN6O/c1-2-17-8-5(11)3-13-4-6(8)14-10(17)7-9(12)16-18-15-7/h3-4H,2H2,1H3,(H2,12,16)
NCI pathway
Reactome pathway
n/an/a 9n/an/an/an/an/an/a
GlaxoSmithKline Pharmaceuticals
Curated by ChEMBL
Assay Description
Inhibitory concentration against MSK-1
Bioorg Med Chem Lett 15: 3407-11 (2005)
Article DOI: 10.1016/j.bmcl.2005.05.020
BindingDB Entry DOI: 10.7270/Q2S75FVN