null
SMILES: NC(=O)c1cncc(OCc2cccc(NC(=O)c3ccc(nc3)-c3ccccc3)c2)c1
InChI Key: InChIKey=OSWWHUFRYVMBLP-UHFFFAOYSA-N
Activity Spreadsheet -- Enzyme Inhibition Constant Data from BindingDB
Found 3 hits for monomerid = 50168929
Trg + Lig
Ki
nM
ΔG°
kcal/mole
IC50
nM
Kd
nM
EC50/IC50
nM
koff
s-1
kon
M-1s-1
pHTemp
°C
NAD-dependent protein deacetylase sirtuin-2
(Homo sapiens (Human))
BDBM50168929
(CHEMBL3805694)
Show SMILES NC(=O)c1cncc(OCc2cccc(NC(=O)c3ccc(nc3)-c3ccccc3)c2)c1
Show InChI InChI=1S/C25H20N4O3/c26-24(30)20-12-22(15-27-13-20)32-16-17-5-4-8-21(11-17)29-25(31)19-9-10-23(28-14-19)18-6-2-1-3-7-18/h1-15H,16H2,(H2,26,30)(H,29,31)
NCI pathway
n/an/a 47n/an/an/an/an/an/a
University of Minnesota
Curated by ChEMBL
Assay Description
Inhibition of recombinant human C-terminal His-tagged SIRT2 (50 to 389 residues) expressed in Escherichia coli using Ac-RHK-K(Ac)-AMC as substrate in...
J Med Chem 59: 2928-41 (2016)
BindingDB Entry DOI: 10.7270/Q2Z89F9W
NAD-dependent protein deacetylase sirtuin-3, mitochondrial
(Homo sapiens (Human))
BDBM50168929
(CHEMBL3805694)
Show SMILES NC(=O)c1cncc(OCc2cccc(NC(=O)c3ccc(nc3)-c3ccccc3)c2)c1
Show InChI InChI=1S/C25H20N4O3/c26-24(30)20-12-22(15-27-13-20)32-16-17-5-4-8-21(11-17)29-25(31)19-9-10-23(28-14-19)18-6-2-1-3-7-18/h1-15H,16H2,(H2,26,30)(H,29,31)
n/an/a 5.85E+3n/an/an/an/an/an/a
University of Minnesota
Curated by ChEMBL
Assay Description
Inhibition of human SIRT3 (102 to 399 residues) expressed in Escherichia coli using Ac-RHK-K(Ac)-AMC as substrate incubated for 2 hrs by fluorescence...
J Med Chem 59: 2928-41 (2016)
BindingDB Entry DOI: 10.7270/Q2Z89F9W
NAD-dependent protein deacetylase sirtuin-1
(Homo sapiens (Human))
BDBM50168929
(CHEMBL3805694)
Show SMILES NC(=O)c1cncc(OCc2cccc(NC(=O)c3ccc(nc3)-c3ccccc3)c2)c1
Show InChI InChI=1S/C25H20N4O3/c26-24(30)20-12-22(15-27-13-20)32-16-17-5-4-8-21(11-17)29-25(31)19-9-10-23(28-14-19)18-6-2-1-3-7-18/h1-15H,16H2,(H2,26,30)(H,29,31)
NCI pathway
Reactome pathway
n/an/a 1.88E+4n/an/an/an/an/an/a
University of Minnesota
Curated by ChEMBL
Assay Description
Inhibition of recombinant human N-terminal His-tagged SIRT1 (1 to 747 residues) expressed in Escherichia coli using Ac-RHK-K(Ac)-AMC as substrate inc...
J Med Chem 59: 2928-41 (2016)
BindingDB Entry DOI: 10.7270/Q2Z89F9W