null
SMILES: NC(=O)c1cncc(OCc2cccc(NC(=O)c3ccc(c(F)c3)-c3ccncc3)c2)c1
InChI Key: InChIKey=UGGZCFOGXLFKGL-UHFFFAOYSA-N
Activity Spreadsheet -- Enzyme Inhibition Constant Data from BindingDB
Found 3 hits for monomerid = 50168936
Trg + Lig
Ki
nM
ΔG°
kcal/mole
IC50
nM
Kd
nM
EC50/IC50
nM
koff
s-1
kon
M-1s-1
pHTemp
°C
NAD-dependent protein deacetylase sirtuin-2
(Homo sapiens (Human))
BDBM50168936
(CHEMBL3805492)
Show SMILES NC(=O)c1cncc(OCc2cccc(NC(=O)c3ccc(c(F)c3)-c3ccncc3)c2)c1
Show InChI InChI=1S/C25H19FN4O3/c26-23-12-18(4-5-22(23)17-6-8-28-9-7-17)25(32)30-20-3-1-2-16(10-20)15-33-21-11-19(24(27)31)13-29-14-21/h1-14H,15H2,(H2,27,31)(H,30,32)
NCI pathway
n/an/a 46n/an/an/an/an/an/a
University of Minnesota
Curated by ChEMBL
Assay Description
Inhibition of recombinant human C-terminal His-tagged SIRT2 (50 to 389 residues) expressed in Escherichia coli using Ac-RHK-K(Ac)-AMC as substrate in...
J Med Chem 59: 2928-41 (2016)
BindingDB Entry DOI: 10.7270/Q2Z89F9W
NAD-dependent protein deacetylase sirtuin-3, mitochondrial
(Homo sapiens (Human))
BDBM50168936
(CHEMBL3805492)
Show SMILES NC(=O)c1cncc(OCc2cccc(NC(=O)c3ccc(c(F)c3)-c3ccncc3)c2)c1
Show InChI InChI=1S/C25H19FN4O3/c26-23-12-18(4-5-22(23)17-6-8-28-9-7-17)25(32)30-20-3-1-2-16(10-20)15-33-21-11-19(24(27)31)13-29-14-21/h1-14H,15H2,(H2,27,31)(H,30,32)
n/an/a 5.02E+3n/an/an/an/an/an/a
University of Minnesota
Curated by ChEMBL
Assay Description
Inhibition of human SIRT3 (102 to 399 residues) expressed in Escherichia coli using Ac-RHK-K(Ac)-AMC as substrate incubated for 2 hrs by fluorescence...
J Med Chem 59: 2928-41 (2016)
BindingDB Entry DOI: 10.7270/Q2Z89F9W
NAD-dependent protein deacetylase sirtuin-1
(Homo sapiens (Human))
BDBM50168936
(CHEMBL3805492)
Show SMILES NC(=O)c1cncc(OCc2cccc(NC(=O)c3ccc(c(F)c3)-c3ccncc3)c2)c1
Show InChI InChI=1S/C25H19FN4O3/c26-23-12-18(4-5-22(23)17-6-8-28-9-7-17)25(32)30-20-3-1-2-16(10-20)15-33-21-11-19(24(27)31)13-29-14-21/h1-14H,15H2,(H2,27,31)(H,30,32)
NCI pathway
Reactome pathway
n/an/a 2.23E+3n/an/an/an/an/an/a
University of Minnesota
Curated by ChEMBL
Assay Description
Inhibition of recombinant human N-terminal His-tagged SIRT1 (1 to 747 residues) expressed in Escherichia coli using Ac-RHK-K(Ac)-AMC as substrate inc...
J Med Chem 59: 2928-41 (2016)
BindingDB Entry DOI: 10.7270/Q2Z89F9W