BDBM50169155 (S)-4-Amino-4-((S)-1-carboxy-ethylcarbamoyl)-butyric acid::CHEMBL90074
SMILES: C[C@H](NC(=O)[C@@H](N)CCC(O)=O)C(O)=O
InChI Key: InChIKey=JZDHUJAFXGNDSB-WHFBIAKZSA-N
Data: 2 KI  1 IC50
Activity Spreadsheet -- Enzyme Inhibition Constant Data from BindingDB
Found 3 hits for monomerid = 50169155
Trg + Lig
Ki
nM
ΔG°
kcal/mole
IC50
nM
Kd
nM
EC50/IC50
nM
koff
s-1
kon
M-1s-1
pHTemp
°C
Solute carrier family 15 member 2
(Homo sapiens (Human))
BDBM50169155
((S)-4-Amino-4-((S)-1-carboxy-ethylcarbamoyl)-butyr...)
Show SMILES C[C@H](NC(=O)[C@@H](N)CCC(O)=O)C(O)=O
Show InChI InChI=1S/C8H14N2O5/c1-4(8(14)15)10-7(13)5(9)2-3-6(11)12/h4-5H,2-3,9H2,1H3,(H,10,13)(H,11,12)(H,14,15)/t4-,5-/m0/s1
Reactome pathway
3.00E+4n/an/an/an/an/an/an/an/a
Universit£ degli Studi di Milano
Curated by ChEMBL
Assay Description
Binding affinity to human PepT2 in SKTP cells
Bioorg Med Chem 19: 4544-51 (2011)
Article DOI: 10.1016/j.bmc.2011.06.027
BindingDB Entry DOI: 10.7270/Q2MP549P
Oligopeptide transporter small intestine isoform
(Homo sapiens (Human))
BDBM50169155
((S)-4-Amino-4-((S)-1-carboxy-ethylcarbamoyl)-butyr...)
Show SMILES C[C@H](NC(=O)[C@@H](N)CCC(O)=O)C(O)=O
Show InChI InChI=1S/C8H14N2O5/c1-4(8(14)15)10-7(13)5(9)2-3-6(11)12/h4-5H,2-3,9H2,1H3,(H,10,13)(H,11,12)(H,14,15)/t4-,5-/m0/s1
Reactome pathway
2.50E+5n/an/an/an/an/an/an/an/a
Martin-Luther-University Halle-Wittenberg
Curated by ChEMBL
Assay Description
Binding affinity against membrane transport protein PEPT1 in human Caco-2 cells
J Med Chem 48: 4410-9 (2005)
Article DOI: 10.1021/jm048982w
BindingDB Entry DOI: 10.7270/Q2Q24116
Angiotensin-converting enzyme
(Homo sapiens (Human))
BDBM50169155
((S)-4-Amino-4-((S)-1-carboxy-ethylcarbamoyl)-butyr...)
Show SMILES C[C@H](NC(=O)[C@@H](N)CCC(O)=O)C(O)=O
Show InChI InChI=1S/C8H14N2O5/c1-4(8(14)15)10-7(13)5(9)2-3-6(11)12/h4-5H,2-3,9H2,1H3,(H,10,13)(H,11,12)(H,14,15)/t4-,5-/m0/s1
Reactome pathway
n/an/a 1.00E+7n/an/an/an/an/an/a
University of Illinois at Chicago
Curated by ChEMBL
Assay Description
Biological activity was measured against Angiotensin I converting enzyme
J Med Chem 38: 2705-13 (1995)
BindingDB Entry DOI: 10.7270/Q2GX4CSN